{"text_format":"1","workbook":"xlsx","n_sheets":6,"sheets":["貸切バス","集計用","エラーチェック","補助","第1様式_A","第1様式_B"],"not_rendered":{"charts":0,"images":2,"macros":1,"external_links":0,"defined_names":5,"comments":0,"pivot_tables":0},"unopened":[],"bounds":{"document_bytes":16777216,"sheet_cells":100000,"rows_first":2000,"rows_last":500,"rows_between":2000,"halvings":0,"cell_chars":16384,"cell_head_chars":4096},"cells_cut":0,"cells_raw":0,"read":"whole","date_system":"1900"}

{"sheet":"貸切バス","index":0,"n_rows":362,"n_cols":64,"rows_kept":362,"cut":false,"hidden":false,"merged":[[111,60,111,62],[129,60,129,62],[131,58,132,59],[134,60,134,62],[131,60,131,62],[133,60,133,62],[135,60,135,62],[141,58,142,59],[108,53,109,54],[107,40,107,44],[170,55,170,57],[173,19,174,19],[173,38,174,39],[173,48,174,49],[137,4,138,5],[139,12,140,13],[139,10,140,11],[139,7,140,9],[133,39,134,39],[135,39,136,39],[129,50,129,52],[108,55,108,57],[108,60,108,62],[109,60,109,62],[110,53,111,54],[110,58,111,59],[130,55,130,57],[132,60,132,62],[139,48,140,49],[169,58,170,59],[129,10,130,11],[133,10,134,11],[167,2,168,3],[167,4,168,11],[167,12,168,13],[167,14,168,14],[167,15,168,18],[167,19,168,19],[167,35,167,37],[42,12,42,24],[72,2,72,24],[49,2,49,10],[167,50,167,52],[167,53,168,54],[133,50,133,52],[135,48,136,49],[135,53,136,54],[133,12,134,13],[133,14,134,14],[157,48,158,49],[108,48,109,49],[161,10,162,11],[161,12,162,13],[133,53,134,54],[107,45,107,49],[108,40,108,42],[108,43,109,44],[108,45,108,47],[109,40,109,42],[109,45,109,47],[161,39,162,39],[135,35,135,38],[109,38,109,39],[108,35,108,39],[107,55,107,59],[107,4,107,11],[107,50,107,54],[152,55,152,59],[42,2,42,10],[50,2,50,10],[57,2,57,55],[58,2,58,55],[111,55,111,57],[132,55,132,57],[137,12,138,13],[129,12,130,13],[131,19,132,19],[137,14,138,14],[129,39,130,39],[139,50,139,52],[141,15,142,18],[133,58,134,59],[135,20,136,22],[135,23,136,24],[129,58,130,59],[141,25,142,32],[141,33,142,34],[132,45,132,47],[133,40,133,42],[133,43,134,44],[133,45,133,47],[134,55,134,57],[139,15,140,18],[141,53,142,54],[131,39,132,39],[135,25,136,32],[2,2,2,4],[342,35,342,37],[342,38,342,39],[335,48,335,49],[307,35,307,37],[261,2,261,24],[262,2,262,3],[180,48,180,49],[175,48,176,49],[247,2,247,3],[221,2,222,3],[227,12,227,14],[220,12,220,13],[220,35,220,37],[217,2,217,3],[170,50,170,52],[176,35,176,37],[176,50,176,52],[137,48,138,49],[111,50,111,52],[130,50,130,52],[108,50,108,52],[133,20,134,22],[133,23,134,24],[133,25,134,32],[133,33,134,34],[141,19,142,19],[135,15,136,18],[135,19,136,19],[132,50,132,52],[136,35,136,38],[141,23,142,24],[207,63,207,64],[205,55,205,59],[205,60,205,64],[180,60,180,62],[181,50,181,52],[181,55,181,57],[181,60,181,62],[183,50,183,52],[184,50,184,52],[183,55,183,57],[189,50,189,54],[153,60,153,62],[155,60,155,62],[129,63,130,64],[131,50,131,52],[131,15,132,18],[135,10,136,11],[161,55,161,57],[161,60,161,62],[137,60,137,62],[136,60,136,62],[154,50,154,52],[154,55,154,57],[154,60,154,62],[137,50,137,52],[172,50,172,52],[172,55,172,57],[172,60,172,62],[166,50,166,54],[182,60,182,62],[137,53,138,54],[137,58,138,59],[110,63,111,64],[141,63,142,64],[131,35,131,38],[132,35,132,38],[137,63,138,64],[141,12,142,13],[135,58,136,59],[135,63,136,64],[131,63,132,64],[128,7,128,9],[139,58,140,59],[142,60,142,62],[141,60,141,62],[128,15,128,19],[128,35,128,39],[129,14,130,14],[129,15,130,18],[129,19,130,19],[129,35,129,38],[130,35,130,38],[131,10,132,11],[131,7,132,9],[131,12,132,13],[140,60,140,62],[137,7,138,9],[129,7,130,9],[133,7,134,9],[129,53,130,54],[142,55,142,57],[128,55,128,59],[141,20,142,22],[135,12,136,13],[133,63,134,64],[134,50,134,52],[152,50,152,54],[167,48,168,49],[160,55,160,57],[151,2,151,24],[141,4,142,6],[153,4,154,6],[139,35,139,38],[140,35,140,38],[139,14,140,14],[141,14,142,14],[142,35,142,38],[139,39,140,39],[141,39,142,39],[154,35,154,38],[156,35,156,38],[152,2,152,3],[159,63,160,64],[157,35,157,38],[159,50,159,52],[141,7,142,9],[159,35,159,38],[157,39,158,39],[157,15,158,18],[133,35,133,38],[134,35,134,38],[157,19,158,19],[138,45,138,47],[139,43,140,44],[152,60,152,64],[153,63,154,64],[219,12,219,13],[208,53,208,54],[246,50,246,52],[244,55,244,59],[244,60,244,64],[245,48,245,49],[245,53,245,54],[245,58,245,59],[209,48,209,49],[209,53,209,54],[136,55,136,57],[161,48,162,49],[167,60,167,62],[137,39,138,39],[139,60,139,62],[138,50,138,52],[138,55,138,57],[138,60,138,62],[140,55,140,57],[139,53,140,54],[169,63,170,64],[170,60,170,62],[166,55,166,59],[166,60,166,64],[166,12,166,14],[173,50,173,52],[137,43,138,44],[137,45,137,47],[138,40,138,42],[206,63,206,64],[209,63,209,64],[207,58,207,59],[135,33,136,34],[139,40,139,42],[137,10,138,11],[135,50,135,52],[137,23,138,24],[137,25,138,32],[137,33,138,34],[139,20,140,22],[139,23,140,24],[139,25,140,32],[139,33,140,34],[152,12,152,14],[135,55,135,57],[155,19,156,19],[144,3,144,24],[145,3,145,24],[139,45,139,47],[140,40,140,42],[140,45,140,47],[141,40,141,42],[141,43,142,44],[141,45,141,47],[142,40,142,42],[142,45,142,47],[152,40,152,44],[152,45,152,49],[152,35,152,39],[141,35,141,38],[141,10,142,11],[135,7,136,9],[155,45,155,47],[141,50,141,52],[159,4,160,6],[152,4,152,6],[215,2,215,3],[216,2,216,3],[217,4,217,11],[217,12,217,13],[208,58,208,59],[208,63,208,64],[354,2,354,3],[286,4,286,7],[342,8,342,10],[341,8,341,11],[353,2,353,3],[337,12,337,13],[335,4,335,7],[338,15,338,18],[336,4,336,7],[336,12,336,13],[285,50,285,54],[338,53,338,54],[263,2,263,3],[354,50,354,52],[286,48,286,49],[263,33,263,34],[264,20,264,22],[353,50,353,54],[286,8,286,10],[342,15,342,18],[338,63,338,64],[336,48,336,49],[336,53,336,54],[336,58,336,59],[208,55,208,57],[247,55,247,57],[247,50,247,52],[312,50,312,54],[312,55,312,59],[312,60,312,64],[306,50,306,54],[306,55,306,59],[306,60,306,64],[307,48,307,49],[307,53,307,54],[307,58,307,59],[210,50,210,52],[221,58,221,59],[246,53,246,54],[227,55,227,59],[210,48,210,49],[210,53,210,54],[208,50,208,52],[228,53,228,54],[265,50,265,52],[265,48,265,49],[227,50,227,54],[208,48,208,49],[208,60,208,62],[248,58,248,59],[249,60,249,62],[249,55,249,57],[249,50,249,52],[242,2,242,54],[247,60,247,62],[227,2,227,3],[216,55,216,57],[216,58,216,59],[244,40,244,44],[244,45,244,49],[245,40,245,42],[245,43,245,44],[245,45,245,47],[247,43,247,44],[247,45,247,47],[210,55,210,57],[246,60,246,62],[336,63,336,64],[338,50,338,52],[313,58,313,59],[313,63,313,64],[264,60,264,62],[265,53,265,54],[244,50,244,54],[257,48,257,49],[263,63,263,64],[263,45,263,47],[264,40,264,42],[228,55,228,57],[228,50,228,52],[228,58,228,59],[247,63,247,64],[246,55,246,57],[215,50,215,54],[215,55,215,59],[218,60,218,62],[218,63,218,64],[250,50,250,52],[215,15,215,19],[227,40,227,44],[227,45,227,49],[221,45,221,47],[221,48,221,49],[221,50,221,52],[221,53,221,54],[221,55,221,57],[219,40,219,42],[219,43,219,44],[219,45,219,47],[219,48,219,49],[219,50,219,52],[219,53,219,54],[219,55,219,57],[217,40,217,42],[217,43,217,44],[217,45,217,47],[217,48,217,49],[217,50,217,52],[217,53,217,54],[217,55,217,57],[216,15,216,18],[215,20,215,24],[215,25,215,34],[216,20,216,22],[216,23,216,24],[216,25,216,32],[216,33,216,34],[217,20,217,22],[217,23,217,24],[217,25,217,32],[217,38,217,39],[227,60,227,64],[220,23,220,24],[220,25,220,32],[220,33,220,34],[221,40,221,42],[221,43,221,44],[219,60,219,62],[221,60,221,62],[216,60,216,62],[262,60,262,64],[228,33,228,34],[216,43,216,44],[216,45,216,47],[216,48,216,49],[216,50,216,52],[216,53,216,54],[216,63,216,64],[249,53,249,54],[262,55,262,59],[221,63,221,64],[248,63,248,64],[246,63,246,64],[245,55,245,57],[245,50,245,52],[218,25,218,32],[228,48,228,49],[219,58,219,59],[246,48,246,49],[262,20,262,24],[262,35,262,39],[250,55,250,57],[221,12,221,13],[249,58,249,59],[247,58,247,59],[264,15,264,18],[250,48,250,49],[250,53,250,54],[250,58,250,59],[257,38,257,39],[257,15,257,18],[263,15,263,18],[263,58,263,59],[250,35,250,37],[246,33,246,34],[247,20,247,22],[247,23,247,24],[247,25,247,32],[247,33,247,34],[248,20,248,22],[248,23,248,24],[248,25,248,32],[248,33,248,34],[246,40,246,42],[246,43,246,44],[246,45,246,47],[247,40,247,42],[247,48,247,49],[256,20,256,24],[256,25,256,34],[257,20,257,22],[257,23,257,24],[248,55,248,57],[249,40,249,42],[342,55,342,57],[342,60,342,62],[342,2,342,3],[341,4,341,7],[342,4,342,7],[335,63,335,64],[338,60,338,62],[337,60,337,62],[336,60,336,62],[285,12,285,14],[285,8,285,11],[334,8,334,11],[284,2,284,24],[285,35,285,39],[341,12,341,14],[341,15,341,19],[341,2,341,3],[338,4,338,7],[338,12,338,13],[338,8,338,10],[341,35,341,39],[338,58,338,59],[286,33,286,34],[287,20,287,22],[287,23,287,24],[287,25,287,32],[287,33,287,34],[287,55,287,57],[287,50,287,52],[337,50,337,52],[286,12,286,13],[285,15,285,19],[263,35,263,37],[256,60,256,64],[256,50,256,54],[263,53,263,54],[335,55,335,57],[263,60,263,62],[286,58,286,59],[286,50,286,52],[334,50,334,54],[334,55,334,59],[285,45,285,49],[286,45,286,47],[264,2,264,3],[257,60,257,62],[307,15,307,18],[313,2,313,3],[286,53,286,54],[332,2,332,24],[335,60,335,62],[313,60,313,62],[313,55,313,57],[313,53,313,54],[313,35,313,37],[335,8,335,10],[334,35,334,39],[286,20,286,22],[286,23,286,24],[286,25,286,32],[263,38,263,39],[287,12,287,13],[256,55,256,59],[307,63,307,64],[286,15,286,18],[281,2,281,54],[312,35,312,39],[335,58,335,59],[307,38,307,39],[313,15,313,18],[336,8,336,10],[334,60,334,64],[257,55,257,57],[257,50,257,52],[262,50,262,54],[257,35,257,37],[265,60,265,62],[334,2,334,3],[335,2,335,3],[335,15,335,18],[313,50,313,52],[263,12,263,13],[307,55,307,57],[307,50,307,52],[287,63,287,64],[287,53,287,54],[287,15,287,18],[307,60,307,62],[287,60,287,62],[263,40,263,42],[335,12,335,13],[263,23,263,24],[263,25,263,32],[287,8,287,10],[283,18,283,19],[306,20,306,24],[337,15,337,18],[337,4,337,7],[337,53,337,54],[312,2,312,3],[305,2,305,24],[306,2,306,3],[307,2,307,3],[265,63,265,64],[287,58,287,59],[287,35,287,37],[354,63,354,64],[353,60,353,64],[354,38,354,39],[354,15,354,18],[353,4,353,14],[353,35,353,39],[353,20,353,24],[353,25,353,34],[354,20,354,22],[354,23,354,24],[354,25,354,32],[354,33,354,34],[353,40,353,44],[353,45,353,49],[354,40,354,42],[354,43,354,44],[354,45,354,47],[354,48,354,49],[354,55,354,57],[354,60,354,62],[353,15,353,19],[354,4,354,14],[354,35,354,37],[354,53,354,54],[354,58,354,59],[353,55,353,59],[337,63,337,64],[336,50,336,52],[335,53,335,54],[313,4,313,14],[312,15,312,19],[334,4,334,7],[337,2,337,3],[338,2,338,3],[334,15,334,19],[220,38,220,39],[342,48,342,49],[342,53,342,54],[342,58,342,59],[342,63,342,64],[341,50,341,54],[341,55,341,59],[341,60,341,64],[342,50,342,52],[337,58,337,59],[256,15,256,19],[337,8,337,10],[312,4,312,14],[336,15,336,18],[335,50,335,52],[286,63,286,64],[337,55,337,57],[336,55,336,57],[338,55,338,57],[342,12,342,13],[336,2,336,3],[334,12,334,14],[313,38,313,39],[313,48,313,49],[207,50,207,52],[207,55,207,57],[207,60,207,62],[206,50,206,52],[206,48,206,49],[206,53,206,54],[206,58,206,59],[210,58,210,59],[210,63,210,64],[307,4,307,14],[287,4,287,7],[257,53,257,54],[257,58,257,59],[257,63,257,64],[264,50,264,52],[263,50,263,52],[256,35,256,39],[286,55,286,57],[264,55,264,57],[282,18,282,19],[263,55,263,57],[215,35,215,39],[221,4,221,11],[265,55,265,57],[249,63,249,64],[206,55,206,57],[206,60,206,62],[190,63,190,64],[183,53,183,54],[183,58,183,59],[183,63,183,64],[190,50,190,52],[191,50,191,52],[180,53,180,54],[180,58,180,59],[180,63,180,64],[182,63,182,64],[184,60,184,62],[191,58,191,59],[191,63,191,64],[180,50,180,52],[180,55,180,57],[181,63,181,64],[182,50,182,52],[182,53,182,54],[182,58,182,59],[184,53,184,54],[184,58,184,59],[184,63,184,64],[190,55,190,57],[221,33,221,34],[209,33,209,34],[171,60,171,62],[173,60,173,62],[173,63,174,64],[174,50,174,52],[174,55,174,57],[174,60,174,62],[171,48,172,49],[179,60,179,64],[175,53,176,54],[173,53,174,54],[173,55,173,57],[173,58,174,59],[175,55,175,57],[175,58,176,59],[175,60,175,62],[175,63,176,64],[189,55,189,59],[189,60,189,64],[183,60,183,62],[183,48,183,49],[176,55,176,57],[176,60,176,62],[184,55,184,57],[179,55,179,59],[171,63,172,64],[191,55,191,57],[190,60,190,62],[190,48,190,49],[190,53,190,54],[190,58,190,59],[110,48,111,49],[286,60,286,62],[249,15,249,18],[250,15,250,18],[265,2,265,3],[264,48,264,49],[263,48,263,49],[264,53,264,54],[264,58,264,59],[286,2,286,3],[287,2,287,3],[306,4,306,14],[306,15,306,19],[182,55,182,57],[169,48,170,49],[169,50,169,52],[169,53,170,54],[169,55,169,57],[162,50,162,52],[285,4,285,7],[250,4,250,11],[263,4,263,11],[262,12,262,14],[225,2,225,24],[169,60,169,62],[169,2,170,3],[169,12,170,13],[169,14,170,14],[162,35,162,38],[248,2,248,3],[257,2,257,3],[262,45,262,49],[108,63,109,64],[109,55,109,57],[285,60,285,64],[264,4,264,11],[264,12,264,13],[279,2,279,24],[248,38,248,39],[249,2,249,3],[249,12,249,13],[249,35,249,37],[249,38,249,39],[285,2,285,3],[182,48,182,49],[191,60,191,62],[209,58,209,59],[161,7,162,9],[161,14,162,14],[161,15,162,18],[166,4,166,11],[162,55,162,57],[264,35,264,37],[264,38,264,39],[265,4,265,11],[265,12,265,13],[265,38,265,39],[191,53,191,54],[256,2,256,3],[285,55,285,59],[221,23,221,24],[221,25,221,32],[263,20,263,22],[262,40,262,44],[221,35,221,37],[221,38,221,39],[227,35,227,39],[228,35,228,37],[228,38,228,39],[246,15,246,18],[257,4,257,11],[257,12,257,13],[255,2,255,24],[245,2,245,3],[244,4,244,11],[227,4,227,11],[227,15,227,19],[228,4,228,11],[243,2,243,24],[244,2,244,3],[228,2,229,3],[245,38,245,39],[245,15,245,18],[246,4,246,11],[227,25,227,34],[228,20,228,22],[228,23,228,24],[250,12,250,13],[249,20,249,22],[249,23,249,24],[249,25,249,32],[249,33,249,34],[250,20,250,22],[250,23,250,24],[228,12,228,13],[244,15,244,19],[209,50,209,52],[209,55,209,57],[210,60,210,62],[209,60,209,62],[264,63,264,64],[265,15,265,18],[265,58,265,59],[245,63,245,64],[228,60,228,62],[262,4,262,11],[256,4,256,11],[256,12,256,14],[262,15,262,19],[221,20,221,22],[247,4,247,11],[218,33,218,34],[219,20,219,22],[219,23,219,24],[219,25,219,32],[219,33,219,34],[220,20,220,22],[248,40,248,42],[248,43,248,44],[248,45,248,47],[257,25,257,32],[257,33,257,34],[256,40,256,44],[256,45,256,49],[257,40,257,42],[257,43,257,44],[257,45,257,47],[262,25,262,34],[222,4,222,64],[229,4,229,64],[244,20,244,24],[244,25,244,34],[245,20,245,22],[245,23,245,24],[245,25,245,32],[245,33,245,34],[246,20,246,22],[246,23,246,24],[248,60,248,62],[250,63,250,64],[250,60,250,62],[249,48,249,49],[228,25,228,32],[248,15,248,18],[228,63,228,64],[245,4,245,11],[249,4,249,11],[248,4,248,11],[248,53,248,54],[249,43,249,44],[249,45,249,47],[220,2,220,3],[181,48,181,49],[181,53,181,54],[179,50,179,54],[179,2,179,3],[191,35,191,37],[219,2,219,3],[209,12,209,13],[181,2,181,3],[182,2,182,3],[183,2,183,3],[208,38,208,39],[180,4,180,11],[180,38,180,39],[180,15,180,18],[208,4,208,11],[208,12,208,13],[208,35,208,37],[208,15,208,18],[207,4,207,11],[206,15,206,18],[207,15,207,18],[179,20,179,24],[179,25,179,34],[215,12,215,14],[218,2,218,3],[219,35,219,37],[219,38,219,39],[210,15,210,18],[207,53,207,54],[215,40,215,44],[215,45,215,49],[175,2,176,3],[157,4,158,6],[218,15,218,18],[219,15,219,18],[209,2,209,3],[189,2,189,3],[189,4,189,11],[189,12,189,14],[184,2,184,3],[182,4,182,11],[182,12,182,13],[210,38,210,39],[171,35,171,37],[216,4,216,11],[216,12,216,13],[216,35,216,37],[216,38,216,39],[191,2,191,3],[204,2,204,24],[205,2,205,3],[190,15,190,18],[191,15,191,18],[191,4,191,11],[191,12,191,13],[183,15,183,18],[179,4,179,11],[180,2,180,3],[219,4,219,11],[217,15,217,18],[215,4,215,11],[175,4,176,11],[182,25,182,32],[190,2,190,3],[214,2,214,24],[171,15,172,18],[171,19,172,19],[175,38,176,39],[173,35,173,37],[210,2,210,3],[169,15,170,18],[169,19,170,19],[169,35,169,37],[169,38,170,39],[181,35,181,37],[181,38,181,39],[182,35,182,37],[184,4,184,11],[184,12,184,13],[184,35,184,37],[184,38,184,39],[175,35,175,37],[181,12,181,13],[179,12,179,14],[179,15,179,19],[179,35,179,39],[180,35,180,37],[180,12,180,13],[182,38,182,39],[209,35,209,37],[209,38,209,39],[209,4,209,11],[181,15,181,18],[189,15,189,19],[189,35,189,39],[190,4,190,11],[190,12,190,13],[190,35,190,37],[190,38,190,39],[182,15,182,18],[184,15,184,18],[183,12,183,13],[181,4,181,11],[206,38,206,39],[175,20,176,22],[175,23,176,24],[175,25,176,32],[175,33,176,34],[191,38,191,39],[181,23,181,24],[181,25,181,32],[181,33,181,34],[182,20,182,22],[182,23,182,24],[183,25,183,32],[183,33,183,34],[184,20,184,22],[184,23,184,24],[184,25,184,32],[184,33,184,34],[205,20,205,24]],"merged_total":1726,"flags":["merged_cut"]}
[null,null,null,null,null,null,null,null,null,null,null,null,null,null,null,null,null,null,null,null,null,null,null,null,null,null,null,null,null,"☑"]
[null,null,null,null,null,null,null,null,null,null,null,null,null,null,null,null,null,null,null,null,null,null,null,null,null,null,null,null,null,"□"]
[null,null,"整理番号",null,null,null,null,null,null,null,null,null,null,null,null,null,null,null,null,null,null,null,null,null,null,null,null,null,null,"〇"]
[null,null,"事業者名",null,null,null,null,null,null,null,"住所"]
[]
[null,null,"代表者氏名",null,null,null,null,null,null,null,"ご担当者名"]
[]
[null,null,"ご連絡先\n(ご担当者)",null,null,null,null,null,null,null,"E-mail \n(ご担当者)"]
[]
[]
[null,null,"　貸切バス事業者安全性評価認定制度における認定状況",null,null,null,null,null,null,null,null,null,null,null,null,null,null,"三ツ星",null,"二ツ星",null,"一ツ星",null,"認定なし",null,null,null,null,4,{"$f":"IF(COUNTIF(R12:Y12,AD$3)=1,0,1)","v":1}]
[null,null,"　※一部の補助メニューについては同認定を受けたものに限ります",null,null,null,null,null,null,null,null,null,null,null,null,null,null,"",null,null,null,null,null,null,null,null,null,null,3]
[null,null,null,null,null,null,null,null,null,null,null,null,null,null,null,null,null,null,null,null,null,null,null,null,null,null,null,null,2]
[null,"振込先銀行情報",null,null,null,null,null,null,null,null,null,null,null,null,null,null,null,null,null,null,null,null,null,null,null,null,null,null,1]
[null,null,"銀行名",null,null,null,null,null,null,null,"金融機関コード"]
[]
[null,null,"支店名",null,null,null,null,null,null,null,null,null,null,null,null,null,null,null,null,null,null,null,null,null,null,null,null,null,null,null,null,null,null,"ゆうちょ銀行の方は銀行名に「ゆうちょ銀行」と入力してから\n下記に入力してください"]
[]
[null,null,"支店番号",null,null,null,null,null,null,null,null,null,null,null,null,null,null,null,null,null,null,null,null,null,null,null,null,null,null,null,null,null,null,null,"A","B","C","D","E",null,"F","G","H","I","J","K","L","M"]
[null,null,null,null,null,null,null,null,null,null,null,null,null,null,null,null,null,null,null,null,null,null,null,null,null,null,null,null,null,null,null,null,null,"記号",null,null,null,null,null,"番号"]
[null,null,"口座の種類"]
[null,null,null,null,null,null,null,null,null,null,null,null,null,null,null,null,null,null,null,null,null,null,null,null,null,null,null,null,null,null,null,null,null,"※A～Mは１桁ずつ入力してください"]
[null,null,"口座番号",null,null,null,null,null,null,null,null,null,null,null,null,null,null,null,null,null,null,null,null,null,null,null,null,null,null,null,null,null,null,"※記号（A～E）は計５桁,Fは記入なし,番号(F～M)は最大計８桁"]
[null,null,null,null,null,null,null,null,null,null,null,null,null,null,null,null,null,null,null,null,null,null,null,null,null,null,null,null,null,null,null,null,null,"※番号が８桁未満の場合は左詰めで記入してください"]
[null,null,"フリガナ"]
[]
[null,null,"口座名義人"]
[null,null,null,null,null,null,null,null,null,null,null,null,null,null,null,null,null,null,null,null,null,null,null,null,null,null,null,null,null,null,null,null,null,null,"↑記号・番号入力後に押してください"]
[]
[null,null,null,null,null,null,null,null,null,null,null,null,null,null,null,null,null,null,null,null,null,null,null,null,null,null,null,null,{"$f":"IF(P12=\"○\",4,IF(S12=\"○\",3,IF(U12=\"○\",2,IF(W12=\"○\",1,\"\"))))","v":""}]
[null,null,"※本用紙入力後に、一度は下記チェックボタンを押下してください。"]
[null,null,"チェックボタン",null,null,null,null,null,null,null,null,null,null,null,null,"未チェック"]
[null,null,"※エラーが表示されたら修正を行い、再度チェックボタンを押下してください。",null,null,null,null,null,null,null,null,null,null,null,null,null,null,null,null,null,null,null,null,null,null,null,null,null,null,null,null,"エラーメッセージボックス"]
[null,null,"交付決定額"]
[null,null,{"$f":"SUM(Z:Z)","v":0}]
[]
[null,null,null,null,null,null,null,null,null,null,"A. 交通DX・GXによる\n    経営改善支援事業",null,null,null,null,null,null,"交付申請額計",null,null,null,{"$f":"集計用!$AG$7","v":0}]
[]
[null,null,null,null,null,null,null,null,null,null,"B. 交通サービスインバウンド\n    対応支援事業",null,null,null,null,null,null,"交付申請額\n計",null,null,null,{"$f":"集計用!$AH$7","v":0}]
[]
[null,null,null,null,null,null,null,null,null,null,null,null,null,null,null,null,null,"交付申請額総計",null,null,null,{"$f":"集計用!$AI$7","v":0}]
[]
[]
[]
[]
[]
[]
[]
[]
[]
[]
[]
[]
[]
[]
[]
[null,"各種認証・認定の取得状況"]
[null,null,"　国土交通省では、バス・タクシー事業の人材確保のため、若者や女性を含めた安全・安心で快適な働きやすい職場環境の実現を推進しております。"]
[null,null,"　このため、交付申請書提出時の状況について、以下を回答して下さい。"]
[null,"★","自動車運送事業者のための「働きやすい職場認証制度」の取得状況"]
[null,null,"　国土交通省では、自動車運送事業（トラック・バス・タクシー事業）の運転者不足に対応するための総合的な取組みの一環として、令和２年度に「働きやすい職場認証制度」を創設しました。"]
[null,null,"　自動車運送事業者のための「働きやすい職場認証制度」について詳細、認証制度の取得については以下のHPをご覧ください。（https://www.untenshashokuba.go.jp/）"]
[]
[null,null,"働きやすい職場認証制度の認証取得状況について、該当するもの１つにチェックを入れてください。"]
[]
[null,null,"（１）「三つ星」を取得済み",null,null,null,null,null,null,null,null,null,null,null,null,null,null,null,null,null,null,null,null,"□",null,null,null,null,5,{"$f":"IF(COUNTIF(X66:X70,AD$1)=1,0,1)","v":1}]
[null,null,"（２）「二つ星」を取得済み",null,null,null,null,null,null,null,null,null,null,null,null,null,null,null,null,null,null,null,null,"□",null,null,null,null,4]
[null,null,"（３）「一つ星」を取得済み",null,null,null,null,null,null,null,null,null,null,null,null,null,null,null,null,null,null,null,null,"□",null,null,null,null,3]
[null,null,"（４）交付申請時点で認証を取得していないが、事業完了実績報告（令和７年２月頃）までに取得予定",null,null,null,null,null,null,null,null,null,null,null,null,null,null,null,null,null,null,null,null,"□",null,null,null,null,2]
[null,null,"（５）交付申請時点で認証を取得しておらず、事業完了実績報告までに取得する予定もない",null,null,null,null,null,null,null,null,null,null,null,null,null,null,null,null,null,null,null,null,"□",null,null,null,null,1]
[]
[null,"★","女性活躍推進法に基づく「えるぼし」等の認定状況"]
[null,null,"女性活躍推進法に基づく「えるぼし」等の認定状況について、該当するもの１つにチェックを入れてください。"]
[]
[null,null,"（１）「プラチナえるぼし」の認定を受けている",null,null,null,null,null,null,null,null,null,null,null,null,null,null,null,null,null,null,null,null,"□",null,null,null,null,6,{"$f":"IF(COUNTIF(X75:X80,AD$1)=1,0,1)","v":1}]
[null,null,"（２）「えるぼし（３つ星）」の認定を受けている",null,null,null,null,null,null,null,null,null,null,null,null,null,null,null,null,null,null,null,null,"□",null,null,null,null,5]
[null,null,"（３）「えるぼし（２つ星）」の認定を受けている",null,null,null,null,null,null,null,null,null,null,null,null,null,null,null,null,null,null,null,null,"□",null,null,null,null,4]
[null,null,"（４）「えるぼし（１つ星）」の認定を受けている",null,null,null,null,null,null,null,null,null,null,null,null,null,null,null,null,null,null,null,null,"□",null,null,null,null,3]
[null,null,"（５）交付申請時点で認定を受けていないが、事業完了実績報告（令和７年２月頃）までに認定を受ける予定",null,null,null,null,null,null,null,null,null,null,null,null,null,null,null,null,null,null,null,null,"□",null,null,null,null,2]
[null,null,"（６）交付申請時点で認定を受けておらず、事業完了実績報告までに認定を受ける予定もない",null,null,null,null,null,null,null,null,null,null,null,null,null,null,null,null,null,null,null,null,"□",null,null,null,null,1]
[]
[null,"★","次世代育成支援対策推進法に基づく「くるみんマーク」等の認定状況"]
[null,null,"次世代育成支援対策推進法に基づく「くるみんマーク」等の認定状況について、該当するもの１つにチェックを入れてください。"]
[]
[null,null,"（１）「プラチナくるみん」の認定を受けている",null,null,null,null,null,null,null,null,null,null,null,null,null,null,null,null,null,null,null,null,"□",null,null,null,null,5,{"$f":"IF(COUNTIF(X85:X89,AD$1)=1,0,1)","v":1}]
[null,null,"（２）「くるみん」の認定を受けている",null,null,null,null,null,null,null,null,null,null,null,null,null,null,null,null,null,null,null,null,"□",null,null,null,null,4]
[null,null,"（３）「トライくるみん」の認定を受けている",null,null,null,null,null,null,null,null,null,null,null,null,null,null,null,null,null,null,null,null,"□",null,null,null,null,3]
[null,null,"（４）交付申請時点で認定を受けていないが、事業完了実績報告（令和７年２月頃）までに認定を受ける予定",null,null,null,null,null,null,null,null,null,null,null,null,null,null,null,null,null,null,null,null,"□",null,null,null,null,2]
[null,null,"（５）交付申請時点で認定を受けておらず、事業完了実績報告までに認定を受ける予定もない",null,null,null,null,null,null,null,null,null,null,null,null,null,null,null,null,null,null,null,null,"□",null,null,null,null,1]
[]
[null,null,"※1","交付申請又は事業完了実績報告の際には取得状況を証明する書面の提出が必要になります。その際、本申請の回答内容と相違があった場合は、実際の補助金交付額が減額される可能性がありますのでご注意ください。"]
[]
[]
[]
[]
[]
[]
[]
[]
[]
[]
[]
[]
[null,"（別紙様式第1①）　バス車両関係"]
[null,"①","リフト付きバス、エレベーター付きバスの導入　※EVバスは「②EVバスの導入」に記入してください。"]
[null,null,{"$f":"\"・K-\"&C109&\"～K-\"&C111&\"のバス車両の補助対象事業者は、貸切バス事業者安全性評価認定制度の認定を受けた者に限ります。\"","v":"・K-1～K-2のバス車両の補助対象事業者は、貸切バス事業者安全性評価認定制度の認定を受けた者に限ります。"}]
[null,null,"・観光予算での支援を予定しているため、多言語・WiFi・キャッシュレス決済のうち最低でもどれか一つを導入する場合が対象になります。多言語・WiFi・キャッシュレス決済対応にあたって補助金活用の有無は問いません。\n　また、空港アクセスまたは観光周遊への使用する車両である必要があります。"]
[null,null,"整理記号",null,"申請項目",null,null,null,null,null,null,null,"申請台数",null,null,"補助対象経費（税抜）",null,null,null,null,"要望額",null,null,null,null,"内示額",null,null,null,null,null,null,null,null,null,"別紙様式第1\n交付申請額",null,null,null,null,"別紙様式第2\n交付決定額",null,null,null,null,"別紙様式第3\n交付決定変更申請額",null,null,null,null,"別紙様式第4\n交付決定変更額",null,null,null,null,"別紙様式第6\n進捗状況額",null,null,null,null,"別紙様式第7\n完了実績額"]
[{"$f":"IF(C109>0,C109,A108&\"a\")","v":1},null,1,null,"リフト付きバスの導入",null,null,null,null,null,null,null,null,null,"台",null,null,null,null,"円",null,null,null,"千円",null,null,null,null,null,null,null,null,null,"千円",null,"（補助対象経費×1/4）",null,null,null,null,null,null,null,"千円",null,null,null,null,"千円",null,null,null,null,"千円",null,null,null,null,"千円",null,null,null,null,"千円"]
[{"$f":"IF(C110>0,C110,A109&\"a\")","v":"1a"},null,null,null,null,null,null,null,null,null,null,null,null,null,null,null,null,null,null,null,null,null,null,null,null,null,null,null,null,null,null,null,null,null,null,{"$f":"IF(AND(M109>0,P109>0),IF(集計用!BA7=1,0,ROUNDDOWN(P109/4000,0)),\"\")","v":""},null,null,"千円"]
[{"$f":"IF(C111>0,C111,#REF!&\"a\")","v":2},null,{"$f":"C109+1","v":2},null,"エレベーター付きバスの導入",null,null,null,null,null,null,null,null,null,"台",null,null,null,null,"円",null,null,null,"千円",null,null,null,null,null,null,null,null,null,"千円",null,"（補助対象経費×1/4）",null,null,null,null,null,null,null,"千円",null,null,null,null,"千円",null,null,null,null,"千円",null,null,null,null,"千円",null,null,null,null,"千円"]
[{"$f":"IF(C112>0,C112,A111&\"a\")","v":"2a"},null,null,null,null,null,null,null,null,null,null,null,null,null,null,null,null,null,null,null,null,null,null,null,null,null,null,null,null,null,null,null,null,null,null,{"$f":"IF(AND(M111>0,P111>0),IF(集計用!BA7=1,0,ROUNDDOWN(P111/4000,0)),\"\")","v":""},null,null,"千円"]
[]
[]
[]
[]
[]
[]
[]
[]
[]
[]
[]
[null,"②","EVバスの導入"]
[]
[null,null,"（EVバス支援事業一覧）\n(1)商用車の電動化促進事業（環境省・経済産業省連携事業）\n(2)地域公共交通確保維持改善事業（交通DX・GXによる経営改善支援）　"]
[]
[null,null,"EV車両の導入補助については、申請台数、金額等を踏まえて補助方針を定めます。"]
[null,null,"整理記号",null,"申請項目",null,null,"製造メーカー",null,null,"着手時期",null,"申請台数",null,null,"補助対象経費（税抜）",null,null,null,null,"要望額",null,null,null,null,"内示額",null,null,null,null,null,null,null,null,null,"別紙様式第1\n交付申請額",null,null,null,null,"別紙様式第2\n交付決定額",null,null,null,null,"別紙様式第3\n交付決定変更申請額",null,null,null,null,"別紙様式第4\n交付決定変更額",null,null,null,null,"別紙様式第6\n進捗状況額",null,null,null,null,"別紙様式第7\n完了実績額"]
[{"$f":"IF(C130>0,C130,A129&\"a\")","v":3},null,{"$f":"C111+1","v":3},null,"EVバス（全長約7.0m）の導入",null,null,null,null,null,null,null,null,null,"台",null,null,null,null,"円",null,null,null,"千円",null,null,null,null,null,null,null,null,null,"千円",null,"(補助対象経費×1/3)\n※1台あたり1,500万円",null,null,null,"千円",null,null,null,"千円",null,null,null,null,"千円",null,null,null,null,"千円",null,null,null,null,"千円",null,null,null,null,"千円"]
["3a",null,null,null,null,null,null,null,null,null,null,null,null,null,null,null,null,null,null,null,null,null,null,null,null,null,null,null,null,null,null,null,null,null,null,{"$f":"IF(AND(M130 = \"\", P130 = \"\"),\"\",IF(P130/M130>150000000,15000*M130,IF(AND(M130>0,P130>0),ROUNDDOWN(P130/3000,0),\"\")))","v":""}]
[4,null,{"$f":"C130+1","v":4},null,"EVバス（全長約9.0m）の導入",null,null,null,null,null,null,null,null,null,"台",null,null,null,null,"円",null,null,null,"千円",null,null,null,null,null,null,null,null,null,"千円",null,"(補助対象経費×1/3)\n※1台あたり1,500万円",null,null,null,"千円",null,null,null,"千円",null,null,null,null,"千円",null,null,null,null,"千円",null,null,null,null,"千円",null,null,null,null,"千円"]
["4a",null,null,null,null,null,null,null,null,null,null,null,null,null,null,null,null,null,null,null,null,null,null,null,null,null,null,null,null,null,null,null,null,null,null,{"$f":"IF(AND(M132 = \"\", P132 = \"\"),\"\",IF(P132/M132>150000000,15000*M132,IF(AND(M132>0,P132>0),ROUNDDOWN(P132/3000,0),\"\")))","v":""}]
[5,null,{"$f":"C132+1","v":5},null,"EVバス（全長約10.5m）の導入",null,null,null,null,null,null,null,null,null,"台",null,null,null,null,"円",null,null,null,"千円",null,null,null,null,null,null,null,null,null,"千円",null,"(補助対象経費×1/3)\n※1台あたり1,500万円",null,null,null,"千円",null,null,null,"千円",null,null,null,null,"千円",null,null,null,null,"千円",null,null,null,null,"千円",null,null,null,null,"千円"]
["5a",null,null,null,null,null,null,null,null,null,null,null,null,null,null,null,null,null,null,null,null,null,null,null,null,null,null,null,null,null,null,null,null,null,null,{"$f":"IF(AND(M134 = \"\", P134 = \"\"),\"\",IF(P134/M134>150000000,15000*M134,IF(AND(M134>0,P134>0),ROUNDDOWN(P134/3000,0),\"\")))","v":""}]
[6,null,{"$f":"C134+1","v":6},null,"EVバス（全長約12.0m）の導入",null,null,null,null,null,null,null,null,null,"台",null,null,null,null,"円",null,null,null,"千円",null,null,null,null,null,null,null,null,null,"千円",null,"(補助対象経費×1/3)\n※1台あたり1,500万円",null,null,null,"千円",null,null,null,"千円",null,null,null,null,"千円",null,null,null,null,"千円",null,null,null,null,"千円",null,null,null,null,"千円"]
["6a",null,null,null,null,null,null,null,null,null,null,null,null,null,null,null,null,null,null,null,null,null,null,null,null,null,null,null,null,null,null,null,null,null,null,{"$f":"IF(AND(M136 = \"\", P136 = \"\"),\"\",IF(P136/M136>150000000,15000*M136,IF(AND(M136>0,P136>0),ROUNDDOWN(P136/3000,0),\"\")))","v":""}]
[7,null,{"$f":"C136+1","v":7},null,"プラグインハイブリッドバス、FCVバス、全長が上記いずれでもないバス等、上記に当てはまらないバスの導入",null,"動力源",null,null,null,null,null,null,null,"台",null,null,null,null,"円",null,null,null,"千円",null,null,null,null,null,null,null,null,null,"千円",null,"(補助対象経費×1/3)\n※1台あたり1,500万円",null,null,null,"千円",null,null,null,"千円",null,null,null,null,"千円",null,null,null,null,"千円",null,null,null,null,"千円",null,null,null,null,"千円"]
["7a",null,null,null,null,null,null,null,null,null,null,null,null,null,null,null,null,null,null,null,null,null,null,null,null,null,null,null,null,null,null,null,null,null,null,{"$f":"IF(AND(M138 = \"\", P138 = \"\"),\"\",IF(P138/M138>150000000,15000*M138,IF(AND(M138>0,P138>0),ROUNDDOWN(P138/3000,0),\"\")))","v":""}]
[8,null,{"$f":"C138+1","v":8},null,"EVバス充電設備の導入",null,"総口数",null,null,null,null,null,null,null,"基",null,null,null,null,"円",null,null,null,"千円",null,null,null,null,null,null,null,null,null,"千円",null,"(補助対象経費×1/3)",null,null,null,"千円",null,null,null,"千円",null,null,null,null,"千円",null,null,null,null,"千円",null,null,null,null,"千円",null,null,null,null,"千円"]
["8a",null,null,null,null,null,null,null,null,null,null,null,null,null,null,null,null,null,null,null,null,null,null,null,null,null,null,null,null,null,null,null,null,null,null,{"$f":"IF(AND(M140=\"\",P140=\"\"),\"\",IF(AND(M140>0,P140>0),ROUNDDOWN(P140/3000,0),\"\"))","v":""}]
[9,null,{"$f":"C140+1","v":9},null,"EVバス充電設備の工事費",null,null,null,null,null,null,null,null,null,"箇所",null,null,null,null,"円",null,null,null,"千円",null,null,null,null,null,null,null,null,null,"千円",null,"(補助対象経費×1/2)\n※1台あたり300万円",null,null,null,"千円",null,null,null,"千円",null,null,null,null,"千円",null,null,null,null,"千円",null,null,null,null,"千円",null,null,null,null,"千円"]
["9a",null,null,null,null,null,null,null,null,null,null,null,null,null,null,null,null,null,null,null,null,null,null,null,null,null,null,null,null,null,null,null,null,null,null,{"$f":"IF(AND(M142 = \"\", P142 = \"\"),\"\",IF(P142/M142>3000000,3000*M142,IF(AND(M142>0,P142>0),ROUNDDOWN(P142/2000,0),\"\")))","v":""}]
[]
[]
[]
[null,null,"※1","EVバス充電設備の導入並びにEVバス充電設備の工事費については、原則としてEV車両の購入とセットの場合のみ補助対象となります。"]
[]
[]
[null,null,"（EVバス支援事業一覧）\n(1)商用車の電動化促進事業（環境省・経済産業省連携事業）\n(2)ポストコロナを見据えた受入環境整備促進事業補助金（交通サービスインバウンド対応支援事業）"]
[]
[null,null,"EV車両の導入補助については、申請台数、金額等を踏まえて補助方針を定めます。"]
[null,null,"整理記号",null,"申請項目",null,null,"製造メーカー",null,null,"着手時期",null,"申請台数",null,null,"補助対象経費（税抜）",null,null,null,null,"要望額",null,null,null,null,"内示額",null,null,null,null,null,null,null,null,null,"別紙様式第1\n交付申請額",null,null,null,null,"別紙様式第2\n交付決定額",null,null,null,null,"別紙様式第3\n交付決定変更申請額",null,null,null,null,"別紙様式第4\n交付決定変更額",null,null,null,null,"別紙様式第6\n進捗状況額",null,null,null,null,"別紙様式第7\n完了実績額"]
[{"$f":"IF(C154>0,C154,A153&\"a\")","v":"K-3B"},null,"K-3B",null,"EVバス（全長約7.0m）の導入",null,null,null,null,null,null,null,null,null,"台",null,null,null,null,"円",null,null,null,"千円",null,null,null,null,null,null,null,null,null,"千円",null,"(補助対象経費×1/3)\n※1台あたり1,500万円",null,null,null,"千円",null,null,null,"千円",null,null,null,null,"千円",null,null,null,null,"千円",null,null,null,null,"千円",null,null,null,null,"千円"]
[{"$f":"IF(C155>0,C155,A154&\"a\")","v":"K-3Ba"},null,null,null,null,null,null,null,null,null,null,null,null,null,null,null,null,null,null,null,null,null,null,null,null,null,null,null,null,null,null,null,null,null,null,{"$f":"IF(AND(M154 = \"\", P154 = \"\"),\"\",IF(P154/M154>150000000,15000*M154,IF(AND(M154>0,P154>0),ROUNDDOWN(P154/3000,0),\"\")))","v":""}]
["K-4B",null,"K-4B",null,"EVバス（全長約9.0m）の導入",null,null,null,null,null,null,null,null,null,"台",null,null,null,null,"円",null,null,null,"千円",null,null,null,null,null,null,null,null,null,"千円",null,"(補助対象経費×1/3)\n※1台あたり1,500万円",null,null,null,"千円",null,null,null,"千円",null,null,null,null,"千円",null,null,null,null,"千円",null,null,null,null,"千円",null,null,null,null,"千円"]
[{"$f":"IF(C157>0,C157,A156&\"a\")","v":"K-4Ba"},null,null,null,null,null,null,null,null,null,null,null,null,null,null,null,null,null,null,null,null,null,null,null,null,null,null,null,null,null,null,null,null,null,null,{"$f":"IF(AND(M156 = \"\", P156 = \"\"),\"\",IF(P156/M156>150000000,15000*M156,IF(AND(M156>0,P156>0),ROUNDDOWN(P156/3000,0),\"\")))","v":""}]
["K-5B",null,"K-5B",null,"EVバス（全長約10.5m）の導入",null,null,null,null,null,null,null,null,null,"台",null,null,null,null,"円",null,null,null,"千円",null,null,null,null,null,null,null,null,null,"千円",null,"(補助対象経費×1/3)\n※1台あたり1,500万円",null,null,null,"千円",null,null,null,"千円",null,null,null,null,"千円",null,null,null,null,"千円",null,null,null,null,"千円",null,null,null,null,"千円"]
[{"$f":"IF(C159>0,C159,A158&\"a\")","v":"K-5Ba"},null,null,null,null,null,null,null,null,null,null,null,null,null,null,null,null,null,null,null,null,null,null,null,null,null,null,null,null,null,null,null,null,null,null,{"$f":"IF(AND(M158 = \"\", P158 = \"\"),\"\",IF(P158/M158>150000000,15000*M158,IF(AND(M158>0,P158>0),ROUNDDOWN(P158/3000,0),\"\")))","v":""}]
["K-6B",null,"K-6B",null,"EVバス（全長約12.0m）の導入",null,null,null,null,null,null,null,null,null,"台",null,null,null,null,"円",null,null,null,"千円",null,null,null,null,null,null,null,null,null,"千円",null,"(補助対象経費×1/3)\n※1台あたり1,500万円",null,null,null,"千円",null,null,null,"千円",null,null,null,null,"千円",null,null,null,null,"千円",null,null,null,null,"千円",null,null,null,null,"千円"]
[{"$f":"IF(C161>0,C161,A160&\"a\")","v":"K-6Ba"},null,null,null,null,null,null,null,null,null,null,null,null,null,null,null,null,null,null,null,null,null,null,null,null,null,null,null,null,null,null,null,null,null,null,{"$f":"IF(AND(M160 = \"\", P160 = \"\"),\"\",IF(P160/M160>150000000,15000*M160,IF(AND(M160>0,P160>0),ROUNDDOWN(P160/3000,0),\"\")))","v":""}]
["K-7B",null,"K-7B",null,"プラグインハイブリッドバス、FCVバス、全長が上記いずれでもないバス等、上記に当てはまらないバスの導入",null,"動力源",null,null,null,null,null,null,null,"台",null,null,null,null,"円",null,null,null,"千円",null,null,null,null,null,null,null,null,null,"千円",null,"(補助対象経費×1/3)\n※1台あたり1,500万円",null,null,null,"千円",null,null,null,"千円",null,null,null,null,"千円",null,null,null,null,"千円",null,null,null,null,"千円",null,null,null,null,"千円"]
[{"$f":"IF(C163>0,C163,A162&\"a\")","v":"K-7Ba"},null,null,null,null,null,null,null,null,null,null,null,null,null,null,null,null,null,null,null,null,null,null,null,null,null,null,null,null,null,null,null,null,null,null,{"$f":"IF(AND(M162 = \"\", P162 = \"\"),\"\",IF(P162/M162>150000000,15000*M162,IF(AND(M162>0,P162>0),ROUNDDOWN(P162/3000,0),\"\")))","v":""}]
[]
[null,"③","訪日外国人旅行者が移動を楽しむ目的で導入するバス"]
[null,null,{"$f":"\"K-\"&C168&\"～K-\"&C176&\"のバス車両の補助対象事業者は、貸切バス事業者安全性評価認定制度の認定を受けた者に限ります。\"","v":"K-14～K-18のバス車両の補助対象事業者は、貸切バス事業者安全性評価認定制度の認定を受けた者に限ります。"}]
[null,null,"整理記号",null,"申請項目",null,null,null,null,null,null,null,"申請台数",null,null,"補助対象経費\n（税抜）",null,null,null,null,"要望額",null,null,null,null,"内示額",null,null,null,null,null,null,null,null,null,"別紙様式第1\n交付申請額",null,null,null,null,"別紙様式第2\n交付決定額",null,null,null,null,"別紙様式第3\n交付決定変更申請額",null,null,null,null,"別紙様式第4\n交付決定変更額",null,null,null,null,"別紙様式第6\n進捗状況額",null,null,null,null,"別紙様式第7\n完了実績額"]
[{"$f":"IF(C168>0,C168,A167&\"a\")","v":14},null,{"$f":"C142+5","v":14},null,"サイクルバスの導入",null,null,null,null,null,null,null,null,null,"台",null,null,null,null,"円",null,null,null,"千円",null,null,null,null,null,null,null,null,null,"千円",null,"（申請台数×1,400千円）",null,null,"千円",null,null,null,null,"千円",null,null,null,null,"千円",null,null,null,null,"千円",null,null,null,null,"千円",null,null,null,null,"千円"]
[{"$f":"IF(C169>0,C169,A168&\"a\")","v":"14a"},null,null,null,null,null,null,null,null,null,null,null,null,null,null,null,null,null,null,null,null,null,null,null,null,null,null,null,null,null,null,null,null,null,null,{"$f":"IF(AND(M168>0,P168>0),IF(集計用!BA7=1,0,M168*1400),\"\")","v":""}]
[{"$f":"IF(C170>0,C170,A169&\"a\")","v":15},null,{"$f":"C168+1","v":15},null,"水陸両用バスの導入",null,null,null,null,null,null,null,null,null,"台",null,null,null,null,"円",null,null,null,"千円",null,null,null,null,null,null,null,null,null,"千円",null,"（申請台数×1,400千円）",null,null,"千円",null,null,null,null,"千円",null,null,null,null,"千円",null,null,null,null,"千円",null,null,null,null,"千円",null,null,null,null,"千円"]
["15a",null,null,null,null,null,null,null,null,null,null,null,null,null,null,null,null,null,null,null,null,null,null,null,null,null,null,null,null,null,null,null,null,null,null,{"$f":"IF(AND(M170>0,P170>0),IF(集計用!BA7=1,0,M170*1400),\"\")","v":""}]
[16,null,{"$f":"C170+1","v":16},null,"オープントップバスの導入",null,null,null,null,null,null,null,null,null,"台",null,null,null,null,"円",null,null,null,"千円",null,null,null,null,null,null,null,null,null,"千円",null,"（申請台数×1,400千円）",null,null,"千円",null,null,null,null,"千円",null,null,null,null,"千円",null,null,null,null,"千円",null,null,null,null,"千円",null,null,null,null,"千円"]
["16a",null,null,null,null,null,null,null,null,null,null,null,null,null,null,null,null,null,null,null,null,null,null,null,null,null,null,null,null,null,null,null,null,null,null,{"$f":"IF(AND(M172>0,P172>0),IF(集計用!BA7=1,0,M172*1400),\"\")","v":""}]
[17,null,{"$f":"C172+1","v":17},null,"訪日外国人旅行者の富裕層向け周遊用バスの導入\n（シート幅の大幅拡張や、伝統工芸を活用した内装を施す等の改造を行った車両）",null,null,null,null,null,null,null,null,null,"台",null,null,null,null,"円",null,null,null,"千円",null,null,null,null,null,null,null,null,null,"千円",null,"（補助対象経費×1/3）",null,null,"千円",null,null,null,null,"千円",null,null,null,null,"千円",null,null,null,null,"千円",null,null,null,null,"千円",null,null,null,null,"千円"]
["17a",null,null,null,null,null,null,null,null,null,null,null,null,null,null,null,null,null,null,null,null,null,null,null,null,null,null,null,null,null,null,null,null,null,null,{"$f":"IF(AND(M174=\"\",P174=\"\"),\"\",IF(AND(M174>0,P174>0),IF(集計用!BA7=1,0,ROUNDDOWN(P174/3000,0)),\"\"))","v":""}]
[{"$f":"IF(C176>0,C176,A173&\"a\")","v":18},null,{"$f":"C174+1","v":18},null,"上記以外のバスの導入\n（例：レストランバス　仮想現実等の車内でエンターテインメントを提供する車両等）",null,null,null,null,null,null,null,null,null,"台",null,null,null,null,"円",null,null,null,"千円",null,null,null,null,null,null,null,null,null,"千円",null,"（申請台数×1,400千円）",null,null,"千円",null,null,null,null,"千円",null,null,null,null,"千円",null,null,null,null,"千円",null,null,null,null,"千円",null,null,null,null,"千円"]
["18a",null,null,null,null,null,null,null,null,null,null,null,null,null,null,null,null,null,null,null,null,null,null,null,null,null,null,null,null,null,null,null,null,null,null,{"$f":"IF(AND(M176>0,P176>0),IF(集計用!BA7=1,0,M176*1400),\"\")","v":""}]
[]
[null,"④","運行計画及び運行管理業務に関わるデジタル機器等"]
[null,null,"整理記号",null,"申請項目",null,null,null,null,null,null,null,"申請台数",null,null,"補助対象経費（税抜）",null,null,null,null,"要望額",null,null,null,null,"内示額",null,null,null,null,null,null,null,null,null,"別紙様式第1\n交付申請額\n（対象経費／４）",null,null,null,null,"別紙様式第2\n交付決定額",null,null,null,null,"別紙様式第3\n交付決定変更申請額",null,null,null,null,"別紙様式第4\n交付決定変更額",null,null,null,null,"別紙様式第6\n進捗状況額",null,null,null,null,"別紙様式第7\n完了実績額"]
[{"$f":"IF(C181>0,C181,A180&\"a\")","v":19},null,{"$f":"C176+1","v":19},null,"運行管理支援システム",null,null,null,null,null,null,null,null,null,"式",null,null,null,null,"円",null,null,null,"千円",null,null,null,null,null,null,null,null,null,"千円",null,{"$f":"IFERROR(IF(AND(M181>0,P181>0),ROUNDDOWN(P181/4000,0),\"\"),\"\")","v":""},null,null,"千円",null,null,null,null,"千円",null,null,null,null,"千円",null,null,null,null,"千円",null,null,null,null,"千円",null,null,null,null,"千円"]
[20,null,{"$f":"C181+1","v":20},null,"乗務日報自動作成システム",null,null,null,null,null,null,null,null,null,"式",null,null,null,null,"円",null,null,null,"千円",null,null,null,null,null,null,null,null,null,"千円",null,{"$f":"IFERROR(IF(AND(M182>0,P182>0),ROUNDDOWN(P182/4000,0),\"\"),\"\")","v":""},null,null,"千円",null,null,null,null,"千円",null,null,null,null,"千円",null,null,null,null,"千円",null,null,null,null,"千円",null,null,null,null,"千円"]
[21,null,{"$f":"C182+1","v":21},null,"車両動態管理システム",null,null,null,null,null,null,null,null,null,"式",null,null,null,null,"円",null,null,null,"千円",null,null,null,null,null,null,null,null,null,"千円",null,"",null,null,"千円",null,null,null,null,"千円",null,null,null,null,"千円",null,null,null,null,"千円",null,null,null,null,"千円",null,null,null,null,"千円"]
[22,null,{"$f":"C183+1","v":22},null,"各種申請書類の作成支援システム",null,null,null,null,null,null,null,null,null,"式",null,null,null,null,"円",null,null,null,"千円",null,null,null,null,null,null,null,null,null,"千円",null,"",null,null,"千円",null,null,null,null,"千円",null,null,null,null,"千円",null,null,null,null,"千円",null,null,null,null,"千円",null,null,null,null,"千円"]
[23,null,{"$f":"C184+1","v":23},null,"売上・利用者動向分析システム",null,null,null,null,null,null,null,null,null,"式",null,null,null,null,"円",null,null,null,"千円",null,null,null,null,null,null,null,null,null,"千円",null,{"$f":"IFERROR(IF(AND(M185>0,P185>0),ROUNDDOWN(P185/4000,0),\"\"),\"\")","v":""},null,null,"千円",null,null,null,null,"千円",null,null,null,null,"千円",null,null,null,null,"千円",null,null,null,null,"千円",null,null,null,null,"千円"]
[]
[]
[]
[null,"⑤","安全管理業務へのデジタル機器等の活用"]
[null,null,"整理記号",null,"申請項目",null,null,null,null,null,null,null,"申請台数",null,null,"補助対象経費（税抜）",null,null,null,null,"要望額",null,null,null,null,"内示額",null,null,null,null,null,null,null,null,null,"別紙様式第1\n交付申請額\n（対象経費／４）",null,null,null,null,"別紙様式第2\n交付決定額",null,null,null,null,"別紙様式第3\n交付決定変更申請額",null,null,null,null,"別紙様式第4\n交付決定変更額",null,null,null,null,"別紙様式第6\n進捗状況額",null,null,null,null,"別紙様式第7\n完了実績額"]
[24,null,{"$f":"C185+1","v":24},null,"事故情報管理システム",null,null,null,null,null,null,null,null,null,"式",null,null,null,null,"円",null,null,null,"千円",null,null,null,null,null,null,null,null,null,"千円",null,{"$f":"IFERROR(IF(AND(M191>0,P191>0),ROUNDDOWN(P191/4000,0),\"\"),\"\")","v":""},null,null,"千円",null,null,null,null,"千円",null,null,null,null,"千円",null,null,null,null,"千円",null,null,null,null,"千円",null,null,null,null,"千円"]
[25,null,{"$f":"C191+1","v":25},null,"車検・定期点検・整備管理システム",null,null,null,null,null,null,null,null,null,"式",null,null,null,null,"円",null,null,null,"千円",null,null,null,null,null,null,null,null,null,"千円",null,{"$f":"IFERROR(IF(AND(M192>0,P192>0),ROUNDDOWN(P192/4000,0),\"\"),\"\")","v":""},null,null,"千円",null,null,null,null,"千円",null,null,null,null,"千円",null,null,null,null,"千円",null,null,null,null,"千円",null,null,null,null,"千円"]
[]
[]
[]
[]
[]
[]
[]
[]
[]
[]
[]
[]
[null,"⑥","勤怠管理業務・収入支出管理業務へのデジタル機器等の活用"]
[null,null,"整理記号",null,"申請項目",null,null,null,null,null,null,null,"申請台数",null,null,"補助対象経費（税抜）",null,null,null,null,"要望額",null,null,null,null,"内示額",null,null,null,null,null,null,null,null,null,"別紙様式第1\n交付申請額\n（対象経費／４）",null,null,null,null,"別紙様式第2\n交付決定額",null,null,null,null,"別紙様式第3\n交付決定変更申請額",null,null,null,null,"別紙様式第4\n交付決定変更額",null,null,null,null,"別紙様式第6\n進捗状況額",null,null,null,null,"別紙様式第7\n完了実績額"]
[{"$f":"IF(C207>0,C207,A206&\"a\")","v":26},null,{"$f":"C192+1","v":26},null,"乗務シフト自動作成システム",null,null,null,null,null,null,null,null,null,"式",null,null,null,null,"円",null,null,null,"千円",null,null,null,null,null,null,null,null,null,"千円",null,{"$f":"IFERROR(IF(AND(M207>0,P207>0),ROUNDDOWN(P207/4000,0),\"\"),\"\")","v":""},null,null,"千円",null,null,null,null,"千円",null,null,null,null,"千円",null,null,null,null,"千円",null,null,null,null,"千円",null,null,null,null,"千円"]
[{"$f":"IF(C208>0,C208,A207&\"a\")","v":27},null,{"$f":"C207+1","v":27},null,"勤怠管理システム",null,null,null,null,null,null,null,null,null,"式",null,null,null,null,"円",null,null,null,"千円",null,null,null,null,null,null,null,null,null,"千円",null,{"$f":"IFERROR(IF(AND(M208>0,P208>0),ROUNDDOWN(P208/4000,0),\"\"),\"\")","v":""},null,null,"千円",null,null,null,null,"千円",null,null,null,null,"千円",null,null,null,null,"千円",null,null,null,null,"千円",null,null,null,null,"千円"]
[{"$f":"IF(C209>0,C209,A208&\"a\")","v":28},null,{"$f":"C208+1","v":28},null,"営業所・乗務員管理システム",null,null,null,null,null,null,null,null,null,"式",null,null,null,null,"円",null,null,null,"千円",null,null,null,null,null,null,null,null,null,"千円",null,"",null,null,"千円",null,null,null,null,"千円",null,null,null,null,"千円",null,null,null,null,"千円",null,null,null,null,"千円",null,null,null,null,"千円"]
[{"$f":"IF(C210>0,C210,A209&\"a\")","v":29},null,{"$f":"C209+1","v":29},null,"売上集計・記録システム",null,null,null,null,null,null,null,null,null,"式",null,null,null,null,"円",null,null,null,"千円",null,null,null,null,null,null,null,null,null,"千円",null,"",null,null,"千円",null,null,null,null,"千円",null,null,null,null,"千円",null,null,null,null,"千円",null,null,null,null,"千円",null,null,null,null,"千円"]
[{"$f":"IF(C211>0,C211,A210&\"a\")","v":30},null,{"$f":"C210+1","v":30},null,"会計管理用事務処理系システム",null,null,null,null,null,null,null,null,null,"式",null,null,null,null,"円",null,null,null,"千円",null,null,null,null,null,null,null,null,null,"千円",null,"",null,null,"千円",null,null,null,null,"千円",null,null,null,null,"千円",null,null,null,null,"千円",null,null,null,null,"千円",null,null,null,null,"千円"]
[]
[]
[]
[null,"➆","利用者利便性向上・その他業務に関わるデジタル機器等"]
[null,null,"整理記号",null,"申請項目",null,null,null,null,null,null,null,"申請台数",null,null,"補助対象経費（税抜）",null,null,null,null,"要望額",null,null,null,null,"内示額",null,null,null,null,null,null,null,null,null,"別紙様式第1\n交付申請額\n（対象経費／４）",null,null,null,null,"別紙様式第2\n交付決定額",null,null,null,null,"別紙様式第3\n交付決定変更申請額",null,null,null,null,"別紙様式第4\n交付決定変更額",null,null,null,null,"別紙様式第6\n進捗状況額",null,null,null,null,"別紙様式第7\n完了実績額"]
[{"$f":"IF(C217>0,C217,A216&\"a\")","v":31},null,{"$f":"C211+1","v":31},null,"車内空間を活用したデジタル広告",null,null,null,null,null,null,null,null,null,"式",null,null,null,null,"円",null,null,null,"千円",null,null,null,null,null,null,null,null,null,"千円",null,{"$f":"IFERROR(IF(AND(M217>0,P217>0),ROUNDDOWN(P217/4000,0),\"\"),\"\")","v":""},null,null,"千円",null,null,null,null,"千円",null,null,null,null,"千円",null,null,null,null,"千円",null,null,null,null,"千円",null,null,null,null,"千円"]
[32,null,{"$f":"C217+1","v":32},null,"コールセンターシステム",null,null,null,null,null,null,null,null,null,"式",null,null,null,null,"円",null,null,null,"千円",null,null,null,null,null,null,null,null,null,"千円",null,{"$f":"IFERROR(IF(AND(M218>0,P218>0),ROUNDDOWN(P218/4000,0),\"\"),\"\")","v":""},null,null,"千円",null,null,null,null,"千円",null,null,null,null,"千円",null,null,null,null,"千円",null,null,null,null,"千円",null,null,null,null,"千円"]
[33,null,{"$f":"C218+1","v":33},null,"スマートフォン等モバイル端末を使った集客に繋がる仕組み",null,null,null,null,null,null,null,null,null,"式",null,null,null,null,"円",null,null,null,"千円",null,null,null,null,null,null,null,null,null,"千円",null,"",null,null,"千円",null,null,null,null,"千円",null,null,null,null,"千円",null,null,null,null,"千円",null,null,null,null,"千円",null,null,null,null,"千円"]
[34,null,{"$f":"C219+1","v":34},null,"デジタルを活用した利用者へのPRや意見収集",null,null,null,null,null,null,null,null,null,"式",null,null,null,null,"円",null,null,null,"千円",null,null,null,null,null,null,null,null,null,"千円",null,"",null,null,"千円",null,null,null,null,"千円",null,null,null,null,"千円",null,null,null,null,"千円",null,null,null,null,"千円",null,null,null,null,"千円"]
[35,null,{"$f":"C220+1","v":35},null,"車内乗客への遠隔案内システム",null,null,null,null,null,null,null,null,null,"式",null,null,null,null,"円",null,null,null,"千円",null,null,null,null,null,null,null,null,null,"千円",null,"",null,null,"千円",null,null,null,null,"千円",null,null,null,null,"千円",null,null,null,null,"千円",null,null,null,null,"千円",null,null,null,null,"千円"]
[36,null,{"$f":"C221+1","v":36},null,"その他",null,null,null,null,null,null,null,null,null,"式",null,null,null,null,"円",null,null,null,"千円",null,null,null,null,null,null,null,null,null,"千円",null,"",null,null,"千円",null,null,null,null,"千円",null,null,null,null,"千円",null,null,null,null,"千円",null,null,null,null,"千円",null,null,null,null,"千円"]
["36a",null,null,null,"事業概要："]
[]
[]
[null,"⑧","デジタル化・システム化等のための調査等"]
[]
[null,null,"整理記号",null,"申請項目",null,null,null,null,null,null,null,"申請台数",null,null,"補助対象経費（税抜）",null,null,null,null,"要望額",null,null,null,null,"内示額",null,null,null,null,null,null,null,null,null,"別紙様式第1\n交付申請額\n（対象経費／４）",null,null,null,null,"別紙様式第2\n交付決定額",null,null,null,null,"別紙様式第3\n交付決定変更申請額",null,null,null,null,"別紙様式第4\n交付決定変更額",null,null,null,null,"別紙様式第6\n進捗状況額",null,null,null,null,"別紙様式第7\n完了実績額"]
[{"$f":"IF(C229>0,C229,A228&\"a\")","v":37},null,{"$f":"C222+1","v":37},null,"調査等",null,null,null,null,null,null,null,null,null,"式",null,null,null,null,"円",null,null,null,"千円",null,null,null,null,null,null,null,null,null,"千円",null,{"$f":"IFERROR(IF(AND(M229>0,P229>0),ROUNDDOWN(P229/4000,0),\"\"),\"\")","v":""},null,null,"千円",null,null,null,null,"千円",null,null,null,null,"千円",null,null,null,null,"千円",null,null,null,null,"千円",null,null,null,null,"千円"]
[{"$f":"IF(C230>0,C230,A229&\"a\")","v":"37a"},null,null,null,"事業概要："]
[]
[]
[]
[]
[]
[]
[]
[]
[]
[]
[]
[null,"（別紙様式第1②）　インバウンド対応設備機器関係"]
[null,null,{"$f":"\"K-\"&C246&\"～K-\"&C266&\"のインバウンド対応設備機器関係の補助対象事業者は、貸切バス事業者安全性評価認定制度の認定を受けた者に限ります。\"","v":"K-38～K-47のインバウンド対応設備機器関係の補助対象事業者は、貸切バス事業者安全性評価認定制度の認定を受けた者に限ります。"}]
[null,"⑨","多言語化への取組み"]
[null,null,"整理記号",null,"申請項目",null,null,null,null,null,null,null,"申請台数",null,null,"補助対象経費（税抜）",null,null,null,null,"要望額",null,null,null,null,"内示額",null,null,null,null,null,null,null,null,null,"別紙様式第1\n交付申請額\n（対象経費／３）",null,null,null,null,"別紙様式第2\n交付決定額",null,null,null,null,"別紙様式第3\n交付決定変更申請額",null,null,null,null,"別紙様式第4\n交付決定変更額",null,null,null,null,"別紙様式第6\n進捗状況額",null,null,null,null,"別紙様式第7\n完了実績額"]
[{"$f":"IF(C246>0,C246,A245&\"a\")","v":38},null,{"$f":"C229+1","v":38},null,"多言語案内用タブレット",null,null,null,null,null,null,null,null,null,"台",null,null,null,null,"円",null,null,null,"千円",null,null,null,null,null,null,null,null,null,"千円",null,{"$f":"IF(AND(M246>0,P246>0),IF(集計用!BA7=1,0,ROUNDDOWN(P246/3000,0)),\"\")","v":""},null,null,"千円",null,null,null,null,"千円",null,null,null,null,"千円",null,null,null,null,"千円",null,null,null,null,"千円",null,null,null,null,"千円"]
[39,null,{"$f":"C246+1","v":39},null,"多言語翻訳システム機器",null,null,null,null,null,null,null,null,null,"台",null,null,null,null,"円",null,null,null,"千円",null,null,null,null,null,null,null,null,null,"千円",null,{"$f":"IF(AND(M247>0,P247>0),IF(集計用!BA7=1,0,ROUNDDOWN(P247/3000,0)),\"\")","v":""},null,null,"千円",null,null,null,null,"千円",null,null,null,null,"千円",null,null,null,null,"千円",null,null,null,null,"千円",null,null,null,null,"千円"]
[40,null,{"$f":"C247+1","v":40},null,"多言語案内サイネージの導入",null,null,null,null,null,null,null,null,null,"台",null,null,null,null,"円",null,null,null,"千円",null,null,null,null,null,null,null,null,null,"千円",null,{"$f":"IF(AND(M248>0,P248>0),IF(集計用!BA7=1,0,ROUNDDOWN(P248/3000,0)),\"\")","v":""},null,null,"千円",null,null,null,null,"千円",null,null,null,null,"千円",null,null,null,null,"千円",null,null,null,null,"千円",null,null,null,null,"千円"]
[41,null,{"$f":"C248+1","v":41},null,"ホームページの多言語表記",null,null,null,null,null,null,null,"ー",null,null,null,null,null,null,"円",null,null,null,"千円",null,null,null,null,null,null,null,null,null,"千円",null,{"$f":"IF(P249>0,IF(集計用!BA7=1,0,ROUNDDOWN(P249/3000,0)),\"\")","v":""},null,null,"千円",null,null,null,null,"千円",null,null,null,null,"千円",null,null,null,null,"千円",null,null,null,null,"千円",null,null,null,null,"千円"]
[42,null,{"$f":"C249+1","v":42},null,"多言語研修の実施",null,null,null,null,null,null,null,null,null,"回",null,null,null,null,"円",null,null,null,"千円",null,null,null,null,null,null,null,null,null,"千円",null,{"$f":"IF(AND(M250>0,P250>0),IF(集計用!BA7=1,0,ROUNDDOWN(P250/3000,0)),\"\")","v":""},null,null,"千円",null,null,null,null,"千円",null,null,null,null,"千円",null,null,null,null,"千円",null,null,null,null,"千円",null,null,null,null,"千円"]
[43,null,{"$f":"C250+1","v":43},null,"その他",null,null,null,null,null,null,null,null,null,"式",null,null,null,null,"円",null,null,null,"千円",null,null,null,null,null,null,null,null,null,"千円",null,{"$f":"IF(AND(M251>0,P251>0),IF(集計用!BA7=1,0,ROUNDDOWN(P251/3000,0)),\"\")","v":""},null,null,"千円",null,null,null,null,"千円",null,null,null,null,"千円",null,null,null,null,"千円",null,null,null,null,"千円",null,null,null,null,"千円"]
["43a",null,null,null,"事業概要："]
[]
[]
[]
[null,"⑩","無料公衆無線ＬＡＮ機器の導入"]
[null,null,"整理記号",null,"申請項目",null,null,null,null,null,null,null,"申請台数",null,null,"補助対象経費（税抜）",null,null,null,null,"要望額",null,null,null,null,"内示額",null,null,null,null,null,null,null,null,null,"別紙様式第1\n交付申請額\n（対象経費／３）",null,null,null,null,"別紙様式第2\n交付決定額",null,null,null,null,"別紙様式第3\n交付決定変更申請額",null,null,null,null,"別紙様式第4\n交付決定変更額",null,null,null,null,"別紙様式第6\n進捗状況額",null,null,null,null,"別紙様式第7\n完了実績額"]
[{"$f":"IF(C258>0,C258,A257&\"a\")","v":44},null,{"$f":"C251+1","v":44},null," 無料公衆無線ＬＡＮ　（無料Ｗｉ-Ｆｉ）",null,null,null,null,null,null,null,null,null,"台",null,null,null,null,"円",null,null,null,"千円",null,null,null,null,null,null,null,null,null,"千円",null,{"$f":"IF(AND(M258>0,P258>0),IF(集計用!BA7=1,0,ROUNDDOWN(P258/3000,0)),\"\")","v":""},null,null,"千円",null,null,null,null,"千円",null,null,null,null,"千円",null,null,null,null,"千円",null,null,null,null,"千円",null,null,null,null,"千円"]
[]
[]
[]
[null,"⑪","情報端末機器用充電機器、非常用電源装置の導入"]
[null,null,"整理記号",null,"申請項目",null,null,null,null,null,null,null,"申請台数",null,null,"補助対象経費（税抜）",null,null,null,null,"要望額",null,null,null,null,"内示額",null,null,null,null,null,null,null,null,null,"別紙様式第1\n交付申請額\n（対象経費／２）",null,null,null,null,"別紙様式第2\n交付決定額",null,null,null,null,"別紙様式第3\n交付決定変更申請額",null,null,null,null,"別紙様式第4\n交付決定変更額",null,null,null,null,"別紙様式第6\n進捗状況額",null,null,null,null,"別紙様式第7\n完了実績額"]
[{"$f":"IF(C264>0,C264,A263&\"a\")","v":45},null,{"$f":"C258+1","v":45},null,"情報端末への電源供給機器",null,null,null,null,null,null,null,null,null,"台",null,null,null,null,"円",null,null,null,"千円",null,null,null,null,null,null,null,null,null,"千円",null,{"$f":"IF(AND(M264>0,P264>0),IF(集計用!BA7=1,0,ROUNDDOWN(P264/2000,0)),\"\")","v":""},null,null,"千円",null,null,null,null,"千円",null,null,null,null,"千円",null,null,null,null,"千円",null,null,null,null,"千円",null,null,null,null,"千円"]
[{"$f":"IF(C265>0,C265,A264&\"a\")","v":46},null,{"$f":"C264+1","v":46},null,"非常用電源装置",null,null,null,null,null,null,null,null,null,"台",null,null,null,null,"円",null,null,null,"千円",null,null,null,null,null,null,null,null,null,"千円",null,{"$f":"IF(AND(M265>0,P265>0),IF(集計用!BA7=1,0,ROUNDDOWN(P265/2000,0)),\"\")","v":""},null,null,"千円",null,null,null,null,"千円",null,null,null,null,"千円",null,null,null,null,"千円",null,null,null,null,"千円",null,null,null,null,"千円"]
[{"$f":"IF(C266>0,C266,A265&\"a\")","v":47},null,{"$f":"C265+1","v":47},null,"その他付随機器",null,null,null,null,null,null,null,null,null,"台",null,null,null,null,"円",null,null,null,"千円",null,null,null,null,null,null,null,null,null,"千円",null,{"$f":"IF(AND(M266>0,P266>0),IF(集計用!BA7=1,0,ROUNDDOWN(P266/2000,0)),\"\")","v":""},null,null,"千円",null,null,null,null,"千円",null,null,null,null,"千円",null,null,null,null,"千円",null,null,null,null,"千円",null,null,null,null,"千円"]
[]
[]
[]
[]
[]
[]
[]
[]
[]
[]
[]
[]
[null,"（別紙様式第1③）　人材確保・育成"]
[null,null,"人材確保・育成に係る申請調査の様式は全事業（乗合・貸切・乗用）共通のものとなっています。\nこのため、特定事業にのみ該当する記載（例「子育てタクシードライバー研修」）については、該当しない事業を営む場合は、御放念ください。"]
[null,"★","事業者情報"]
[null,null,"本資料提出時点における貴社の状況を記入してください。\n運転者数には正社員やフルタイムで労働する者の他、有期雇用、時短勤務、パートタイムの者も含みます。\n事業者団体やグループ会社等で複数社分まとめて申請される場合は、傘下会員の合計値（概数で結構です）を記載してください。"]
[null,null,"○運転者の数　（貸切事業に従事する人数のみ。乗合、乗用は含みません）",null,null,null,null,null,null,null,null,null,null,null,null,null,null,"（",null,null,"）人"]
[null,null,"○保有車両数　（貸切事業用車両のみ、乗合、乗用は含みません）",null,null,null,null,null,null,null,null,null,null,null,null,null,null,"（",null,null,"）両"]
[null,"⑫","二種免許取得のための教習"]
[null,null,"整理記号",null,"申請項目",null,null,null,"１人あたり\n平均経費",null,null,null,"申請人数",null,null,"補助対象経費\n総額（税抜）",null,null,null,null,"要望額",null,null,null,null,"内示額",null,null,null,null,null,null,null,null,null,"別紙様式第1\n交付申請額",null,null,null,null,"別紙様式第2\n交付決定額",null,null,null,null,"別紙様式第3\n交付決定変更申請額",null,null,null,null,"別紙様式第4\n交付決定変更額",null,null,null,null,"別紙様式第6\n進捗状況額",null,null,null,null,"別紙様式第7\n完了実績額"]
[{"$f":"IF(C287>0,C287,A286&\"a\")","v":48},null,{"$f":"C266+1","v":48},null,"二種免許取得のための教習",null,null,null,{"$f":"IF(AND(M287=\"\",P287=\"\"),\"ー\",IFERROR(ROUND(P287/M287,0),\"申請人数を入力してください\"))","v":"ー"},null,null,"円",null,null,"人",null,null,null,null,"円",null,null,null,"千円",null,null,null,null,null,null,null,null,null,"千円",null,{"$f":"IFERROR(IF(集計用!B7<>0,IF(P287*45/200/1000=0,\"\",ROUNDDOWN(P287*45/200/1000,0)),ROUNDDOWN(I287/3800*エラーチェック!G16*エラーチェック!D16,0)),\"\")","v":""},null,null,"千円",null,null,null,null,"千円",null,null,null,null,"千円",null,null,null,null,"千円",null,null,null,null,"千円",null,null,null,null,"千円"]
[{"$f":"IF(C288>0,C288,A287&\"a\")","v":49},null,{"$f":"C287+1","v":49},null,"二種免許取得のための受験資格特例教習",null,null,null,{"$f":"IF(AND(M288=\"\",P288=\"\"),\"ー\",IFERROR(ROUND(P288/M288,0),\"申請人数を入力してください\"))","v":"ー"},null,null,"円",null,null,"人",null,null,null,null,"円",null,null,null,"千円",null,null,null,null,null,null,null,null,null,"千円",null,{"$f":"IFERROR(IF(集計用!B7<>0,IF(P288*45/200/1000=0,\"\",ROUNDDOWN(P288*45/200/1000,0)),ROUNDDOWN(I288/3800*エラーチェック!H16*エラーチェック!D16,0)),\"\")","v":""},null,null,"千円",null,null,null,null,"千円",null,null,null,null,"千円",null,null,null,null,"千円",null,null,null,null,"千円",null,null,null,null,"千円"]
[]
[null,null,"※1","「申請人数」は補助対象期間を通じて想定される人数を記載してください。ただし、「★事業者情報」に記載された情報をもとに交付決定額を算定します。なお、「★事業者情報」の記載内容の虚偽が発覚した際には交付決定額の減額を行う場合もありますので御了承ください。"]
[null,null,"※2","補助対象経費が確認できる書類（教習所のHPなどに掲載された料金案内、見積書など）を提出してください。"]
[null,null,"※3","「普通二種免許」所有者が新たに「大型二種免許」などを取得するための教習経費も対象となります。ただし、乗用の許可のみを持っている事業者が、既に普通二種免許を取得している従業員に大型二種免許を取得させる等の、業務に直接関係無い免許の取得費用は補助対象とはなりません」。"]
[null,null,"※4","運転免許センターで支払う手数料（試験手数料、交付手数料等）や自動車事故対策機構に支払う運転者適性診断の手数料は補助対象とはなりません。"]
[null,null,"※5","補助金を活用する人材を採用後３カ月以上継続して運転者として雇用することを条件とし、補助金交付後に条件を満たしていない事実が確認された場合には返還の対象となります。"]
[]
[]
[]
[]
[]
[]
[]
[]
[]
[]
[]
[null,"⑬","人材確保のための広報活動等"]
[null,null,"整理記号",null,"申請項目",null,null,null,null,null,null,null,null,null,null,"補助対象経費（税抜）",null,null,null,null,"要望額",null,null,null,null,"内示額",null,null,null,null,null,null,null,null,null,"別紙様式第1\n交付申請額",null,null,null,null,"別紙様式第2\n交付決定額",null,null,null,null,"別紙様式第3\n交付決定変更申請額",null,null,null,null,"別紙様式第4\n交付決定変更額",null,null,null,null,"別紙様式第6\n進捗状況額",null,null,null,null,"別紙様式第7\n完了実績額"]
[{"$f":"IF(C308>0,C308,A307&\"a\")","v":50},null,{"$f":"C288+1","v":50},null,"人材確保イベントの参加・開催",null,null,null,null,null,null,null,null,null,null,null,null,null,null,"円",null,null,null,"千円",null,null,null,null,null,null,null,null,null,"千円",null,{"$f":"IFERROR(IF(集計用!$B$7 <>0,IF(P308*45/200/1000=0,\"\",ROUNDDOWN(P308*45/200/1000,0)),IF((MIN(P308/2000,エラーチェック!J$16)*エラーチェック!$D$16)=0,\"\",MIN(ROUNDDOWN(MIN(P308/2000,エラーチェック!J$16)*エラーチェック!$D$16,0),ROUNDDOWN(P308/2000,0)))),\"\")","v":""},null,null,"千円",null,null,null,null,"千円",null,null,null,null,"千円",null,null,null,null,"千円",null,null,null,null,"千円",null,null,null,null,"千円"]
[]
[null,null,"事業の具体的内容を以下に記入してください。"]
[{"$f":"A308&\"a\"","v":"50a"}]
[]
[null,null,"整理記号",null,"申請項目",null,null,null,null,null,null,null,null,null,null,"補助対象経費（税抜）",null,null,null,null,"要望額",null,null,null,null,"内示額",null,null,null,null,null,null,null,null,null,"別紙様式第1\n交付申請額",null,null,null,null,"別紙様式第2\n交付決定額",null,null,null,null,"別紙様式第3\n交付決定変更申請額",null,null,null,null,"別紙様式第4\n交付決定変更額",null,null,null,null,"別紙様式第6\n進捗状況額",null,null,null,null,"別紙様式第7\n完了実績額"]
[{"$f":"IF(C314>0,C314,A313&\"a\")","v":51},null,{"$f":"C308+1","v":51},null,"その他、人材確保のためのPR",null,null,null,null,null,null,null,null,null,null,null,null,null,null,"円",null,null,null,"千円",null,null,null,null,null,null,null,null,null,"千円",null,{"$f":"IFERROR(IF(集計用!$B$7 <>0,IF(P314*45/200/1000=0,\"\",ROUNDDOWN(P314*45/200/1000,0)),IF((MIN(P314/2000,エラーチェック!K$16)*エラーチェック!$D$16)=0,\"\",MIN(ROUNDDOWN(MIN(P314/2000,エラーチェック!K$16)*エラーチェック!$D$16,0),ROUNDDOWN(P314/2000,0)))),\"\")","v":""},null,null,"千円",null,null,null,null,"千円",null,null,null,null,"千円",null,null,null,null,"千円",null,null,null,null,"千円",null,null,null,null,"千円"]
[]
[null,null,"事業の具体的内容を以下に記入してください。"]
[{"$f":"A314&\"a\"","v":"51a"}]
[]
[null,null,"※1","広報活動に係る補助対象経費は補助対象期間を通じて想定される全額を記載してください。ただし、「★事業者情報」に記載された情報をもとに交付決定額を算定します。なお、「★事業者情報」の記載内容の虚偽が発覚した際には交付決定額の減額を行う場合もありますので御了承ください。"]
[null,null,"※2",{"$f":"\"「K-\"&C308&E308&\"」については、人材確保のためのイベントの会場借上、外部委託経費、出展料、これらに相当する費用もしくはこれらに類する費用が対象となります。\"","v":"「K-50人材確保イベントの参加・開催」については、人材確保のためのイベントの会場借上、外部委託経費、出展料、これらに相当する費用もしくはこれらに類する費用が対象となります。"}]
[null,null,"※3",{"$f":"\"「K-\"&C314&E314&\"」については、人材を確保するために事業者等が行う自社又は業界をPRするためのHP作成・改修費用、PR資料の作成費用、外部の求人サイトへの掲載料、その他広告等が対象となります。人材派遣会社への紹介料は対象となりません。\"","v":"「K-51その他、人材確保のためのPR」については、人材を確保するために事業者等が行う自社又は業界をPRするためのHP作成・改修費用、PR資料の作成費用、外部の求人サイトへの掲載料、その他広告等が対象となります。人材派遣会社への紹介料は対象となりません。"}]
[null,null,"※4","事業内容及び価格が分かる資料（見積書など）を添付してください。無いものについては交付決定できない場合があります。"]
[]
[]
[]
[]
[]
[]
[]
[]
[]
[]
[null,"⑭","研修等"]
[null,null,"(1)外部団体等による研修への参加"]
[null,null,"整理記号",null,"申請項目",null,null,null,"１人あたり\n平均経費",null,null,null,"申請人数",null,null,"補助対象経費総額\n（税抜）",null,null,null,null,"要望額",null,null,null,null,"内示額",null,null,null,null,null,null,null,null,null,"別紙様式第1\n交付申請額",null,null,null,null,"別紙様式第2\n交付決定額",null,null,null,null,"別紙様式第3\n交付決定変更申請額",null,null,null,null,"別紙様式第4\n交付決定変更額",null,null,null,null,"別紙様式第6\n進捗状況額",null,null,null,null,"別紙様式第7\n完了実績額"]
[{"$f":"IF(C336>0,C336,A335&\"a\")","v":52},null,{"$f":"C314+1","v":52},null,"UD研修",null,null,null,{"$f":"IF(AND(M336=\"\",P336=\"\"),\"ー\",IFERROR(ROUND(P336/M336,0),\"申請人数を入力してください\"))","v":"ー"},null,null,"円",null,null,"人",null,null,null,null,"円",null,null,null,"千円",null,null,null,null,null,null,null,null,null,"千円",null,{"$f":"IFERROR(IF(集計用!$B$7 <>0,IF(P336*45/200/1000=0,\"\",ROUNDDOWN(P336*45/200/1000,0)),IF((MIN(P336/2000,エラーチェック!L$16)*エラーチェック!$D$16)=0,\"\",MIN(ROUNDDOWN(MIN(P336/2000,エラーチェック!L$16)*エラーチェック!$D$16,0),ROUNDDOWN(P336/2000,0)))),\"\")","v":""},null,null,"千円",null,null,null,null,"千円",null,null,null,null,"千円",null,null,null,null,"千円",null,null,null,null,"千円",null,null,null,null,"千円"]
[{"$f":"IF(C337>0,C337,A336&\"a\")","v":53},null,{"$f":"C336+1","v":53},null,"観光ドライバー認定講習",null,null,null,{"$f":"IF(AND(M337=\"\",P337=\"\"),\"ー\",IFERROR(ROUND(P337/M337,0),\"申請人数を入力してください\"))","v":"ー"},null,null,"円",null,null,"人",null,null,null,null,"円",null,null,null,"千円",null,null,null,null,null,null,null,null,null,"千円",null,{"$f":"IFERROR(IF(集計用!$B$7 <>0,IF(P337*45/200/1000=0,\"\",ROUNDDOWN(P337*45/200/1000,0)),IF((MIN(P337/2000,エラーチェック!M$16)*エラーチェック!$D$16)=0,\"\",MIN(ROUNDDOWN(MIN(P337/2000,エラーチェック!M$16)*エラーチェック!$D$16,0),ROUNDDOWN(P337/2000,0)))),\"\")","v":""},null,null,"千円",null,null,null,null,"千円",null,null,null,null,"千円",null,null,null,null,"千円",null,null,null,null,"千円",null,null,null,null,"千円"]
[{"$f":"IF(C338>0,C338,A337&\"a\")","v":54},null,{"$f":"C337+1","v":54},null,"子育てタクシードライバー研修",null,null,null,{"$f":"IF(AND(M338=\"\",P338=\"\"),\"ー\",IFERROR(ROUND(P338/M338,0),\"申請人数を入力してください\"))","v":"ー"},null,null,"円",null,null,"人",null,null,null,null,"円",null,null,null,"千円",null,null,null,null,null,null,null,null,null,"千円",null,{"$f":"IFERROR(IF(集計用!$B$7 <>0,IF(P338*45/200/1000=0,\"\",ROUNDDOWN(P338*45/200/1000,0)),IF((MIN(P338/2000,エラーチェック!N$16)*エラーチェック!$D$16)=0,\"\",MIN(ROUNDDOWN(MIN(P338/2000,エラーチェック!N$16)*エラーチェック!$D$16,0),ROUNDDOWN(P338/2000,0)))),\"\")","v":""},null,null,"千円",null,null,null,null,"千円",null,null,null,null,"千円",null,null,null,null,"千円",null,null,null,null,"千円",null,null,null,null,"千円"]
[{"$f":"IF(C339>0,C339,A338&\"a\")","v":55},null,{"$f":"C338+1","v":55},null,"運転手実技講習",null,null,null,{"$f":"IF(AND(M339=\"\",P339=\"\"),\"ー\",IFERROR(ROUND(P339/M339,0),\"申請人数を入力してください\"))","v":"ー"},null,null,"円",null,null,"人",null,null,null,null,"円",null,null,null,"千円",null,null,null,null,null,null,null,null,null,"千円",null,{"$f":"IFERROR(IF(集計用!$B$7 <>0,IF(P339*45/200/1000=0,\"\",ROUNDDOWN(P339*45/200/1000,0)),IF((MIN(P339/2000,エラーチェック!O$16)*エラーチェック!$D$16)=0,\"\",MIN(ROUNDDOWN(MIN(P339/2000,エラーチェック!O$16)*エラーチェック!$D$16,0),ROUNDDOWN(P339/2000,0)))),\"\")","v":""},null,null,"千円",null,null,null,null,"千円",null,null,null,null,"千円",null,null,null,null,"千円",null,null,null,null,"千円",null,null,null,null,"千円"]
[]
[null,null,"上記以外については、事業概要とともに以下に記載してください。"]
[null,null,"整理記号",null,"申請項目",null,null,null,"１人あたり\n平均経費",null,null,null,"申請人数",null,null,"補助対象経費総額\n（税抜）",null,null,null,null,"要望額",null,null,null,null,"内示額",null,null,null,null,null,null,null,null,null,"別紙様式第1\n交付申請額",null,null,null,null,"別紙様式第2\n交付決定額",null,null,null,null,"別紙様式第3\n交付決定変更申請額",null,null,null,null,"別紙様式第4\n交付決定変更額",null,null,null,null,"別紙様式第6\n進捗状況額",null,null,null,null,"別紙様式第7\n完了実績額"]
[{"$f":"IF(C343>0,C343,A342&\"a\")","v":56},null,{"$f":"C339+1","v":56},null,null,null,null,null,{"$f":"IF(AND(M343=\"\",P343=\"\"),\"ー\",IFERROR(ROUND(P343/M343,0),\"申請人数を入力してください\"))","v":"ー"},null,null,"円",null,null,"人",null,null,null,null,"円",null,null,null,"千円",null,null,null,null,null,null,null,null,null,"千円",null,{"$f":"IFERROR(IF(集計用!$B$7 <>0,IF(P343*45/200/1000=0,\"\",ROUNDDOWN(P343*45/200/1000,0)),IF((MIN(P343/2000,エラーチェック!P$16)*エラーチェック!$D$16)=0,\"\",MIN(ROUNDDOWN(MIN(P343/2000,エラーチェック!P$16)*エラーチェック!$D$16,0),ROUNDDOWN(P343/2000,0)))),\"\")","v":""},null,null,"千円",null,null,null,null,"千円",null,null,null,null,"千円",null,null,null,null,"千円",null,null,null,null,"千円",null,null,null,null,"千円"]
[null,null,"事業の具体的内容を以下に記入してください。"]
[{"$f":"A343&\"a\"","v":"56a"}]
[]
[null,null,"※1","「申請人数」は補助対象期間を通じて想定される人数を記載してください。ただし、「★事業者情報」に記載された情報をもとに交付決定額を算定します。なお、「★事業者情報」の記載内容の虚偽が発覚した際には交付決定額の減額を行う場合もありますので御了承ください。"]
[null,null,"※2","法令により受講が求められている研修・講習（運行管理者講習、タクシー業務適正化特別措置法に基づく法定研修等）は本調査及び支援の対象外です。"]
[null,null,"※3","業界団体や自治体などの外部団体による研修等については、その研修参加費（受講料等）が対象です。研修内容の詳細のわかるものを添付してください。"]
[null,null,"※4","各研修については、研修内容及び価格が分かる資料（受講案内、見積書など）を添付してください。無いものについては交付決定できない場合があります。"]
[null,null,"※5",{"$f":"\"K-\"&C343&\"に記載する事項が複数ある場合には、研修等の具体的内容を記載する欄に、それぞれの研修の内容がわかるように記載してください。補助対象経費、交付申請額については合計値を記載してください。\"","v":"K-56に記載する事項が複数ある場合には、研修等の具体的内容を記載する欄に、それぞれの研修の内容がわかるように記載してください。補助対象経費、交付申請額については合計値を記載してください。"}]
[]
[null,null,"(2)自社で実施する研修等の開催"]
[null,null,"整理記号",null,"申請項目",null,null,null,null,null,null,null,null,null,null,"補助対象経費（税抜）",null,null,null,null,"要望額",null,null,null,null,"内示額",null,null,null,null,null,null,null,null,null,"別紙様式第1\n交付申請額",null,null,null,null,"別紙様式第2\n交付決定額",null,null,null,null,"別紙様式第3\n交付決定変更申請額",null,null,null,null,"別紙様式第4\n交付決定変更額",null,null,null,null,"別紙様式第6\n進捗状況額",null,null,null,null,"別紙様式第7\n完了実績額"]
[{"$f":"IF(C355>0,C355,A354&\"a\")","v":57},null,{"$f":"C343+1","v":57},null,null,null,null,null,null,null,null,null,null,null,null,null,null,null,null,"円",null,null,null,"千円",null,null,null,null,null,null,null,null,null,"千円",null,{"$f":"IFERROR(IF(集計用!$B$7 <>0,IF(P355*45/200/1000=0,\"\",ROUNDDOWN(P355*45/200/1000,0)),IF((MIN(P355/2000,エラーチェック!Q$16)*エラーチェック!$D$16)=0,\"\",MIN(ROUNDDOWN(MIN(P355/2000,エラーチェック!Q$16)*エラーチェック!$D$16,0),ROUNDDOWN(P355/2000,0)))),\"\")","v":""},null,null,"千円",null,null,null,null,"千円",null,null,null,null,"千円",null,null,null,null,"千円",null,null,null,null,"千円",null,null,null,null,"千円"]
[null,null,"事業の具体的内容を以下に記入してください。"]
[{"$f":"A355&\"a\"","v":"57a"}]
[]
[null,null,"※1","補助対象経費は補助対象期間を通じて想定される全額を記載してください。ただし、「★事業者情報」に記載された情報をもとに交付決定額を算定します。なお、「★事業者情報」の記載内容の虚偽が発覚した際には交付決定額の減額を行う場合もありますので御了承ください。"]
[null,null,"※2","法令により受講が求められている研修・講習（運行管理者講習、タクシー業務適正化特別措置法に基づく法定研修等）は本調査及び支援の対象外です。"]
[null,null,"※3","各研修については、研修内容及び価格が分かる資料（受講案内、見積書など）を添付してください。無いものについては交付決定できない場合があります。"]
[null,null,"※4",{"$f":"\"K-\"&C355&\"に記載する事項が複数ある場合には、研修等の具体的内容を記載する欄に、それぞれの研修の内容がわかるように記載してください。補助対象経費、交付申請額については合計値を記載してください。\"","v":"K-57に記載する事項が複数ある場合には、研修等の具体的内容を記載する欄に、それぞれの研修の内容がわかるように記載してください。補助対象経費、交付申請額については合計値を記載してください。"}]

{"sheet":"集計用","index":1,"n_rows":7,"n_cols":548,"rows_kept":7,"cut":false,"hidden":true,"merged":[[4,335,4,344],[4,345,4,354],[4,365,4,375],[4,315,4,324],[4,325,4,334],[4,243,4,252],[4,283,4,292],[4,253,4,262],[4,293,4,303],[4,304,4,314],[4,20,4,22],[4,123,4,132],[4,133,4,142],[4,53,4,62],[4,63,4,72],[4,73,4,82],[4,83,4,92],[4,93,4,102],[4,103,4,112],[4,113,4,122],[4,502,4,508],[4,515,4,525],[4,427,4,437],[4,143,4,152],[4,153,4,162],[4,193,4,202],[4,203,4,212],[4,163,4,172],[4,173,4,182],[4,183,4,192],[4,223,4,232],[4,233,4,242],[4,213,4,222],[4,273,4,282],[4,263,4,272],[4,491,4,501],[4,469,4,479],[4,480,4,490],[4,458,4,468],[4,355,4,364],[4,416,4,426],[4,376,4,385],[4,438,4,447],[4,448,4,457],[4,406,4,415],[4,396,4,405],[4,386,4,395]]}
[1,2,3,4,5,6,7,8,9,10,11,12,13,14,15,16,17,18,19,20,21,22,23,24,25,26,27,28,29,30,31,32,33,34,35,36,37,38,39,40,41,42,43,44,45,46,47,48,49,50,51,52,53,54,55,56,57,58,59,60,61,62,63,64,65,66,67,68,69,70,71,72,73,74,75,76,77,78,79,80,81,82,83,84,85,86,87,88,89,90,91,92,93,94,95,96,97,98,99,100,101,102,103,104,105,106,107,108,109,110,111,112,113,114,115,116,117,118,119,120,121,122,123,124,125,126,127,128,129,130,131,132,133,134,135,136,137,138,139,140,141,142,143,144,145,146,147,148,149,150,151,152,153,154,155,156,157,158,159,160,161,162,163,164,165,166,167,168,169,170,171,172,173,174,175,176,177,178,179,180,181,182,183,184,185,186,187,188,189,190,191,192,193,194,195,196,197,198,199,200,201,202,203,204,205,206,207,208,209,210,211,212,213,214,215,216,217,218,219,220,221,222,223,224,225,226,227,228,229,230,231,232,233,234,235,236,237,238,239,240,241,242,243,244,245,246,247,248,249,250,251,252,253,254,255,256,257,258,259,260,261,262,263,264,265,266,267,268,269,270,271,272,273,274,275,276,277,278,279,280,281,282,283,284,285,286,287,288,289,290,291,292,293,294,295,296,297,298,299,300,301,302,303,304,305,306,307,308,309,310,311,312,313,314,315,316,317,318,319,320,321,322,323,324,325,326,327,328,329,330,331,332,333,334,335,336,337,338,339,340,341,342,343,344,345,346,347,348,349,350,351,352,353,354,355,356,357,358,359,360,361,362,363,364,365,366,367,368,369,370,371,372,373,374,375,376,377,378,379,380,381,382,383,384,385,386,387,388,389,390,391,392,393,394,395,396,397,398,399,400,401,402,403,404,405,406,407,408,409,410,411,412,413,414,415,416,417,418,419,420,421,422,423,424,425,426,427,428,429,430,431,432,433,434,435,436,437,438,439,440,441,442,443,444,445,446,447,448,449,450,451,452,453,454,455,456,457,458,459,460,461,462,463,464,465,466,467,468,469,470,471,472,473,474,475,476,477,478,479,480,481,482,483,484,485,486,487,488,489,490,491,492,493,494,495,496,497,498,499,500,501,502,503,504,505,506,507,508,509,510,511,512,513,514,515,516,517,518,519,520,521,522,523,524,525,526]
[null,null,null,null,null,null,null,null,null,null,null,null,null,null,null,null,null,null,null,null,null,null,null,null,null,null,null,null,null,null,null,null,null,null,null,null,null,null,null,null,null,null,null,null,null,null,null,null,null,null,null,null,null,13,16,21,26,36,41,46,51,56,61,13,16,21,26,36,41,46,51,56,61,13,16,21,26,36,41,46,51,56,61,13,16,21,26,36,41,46,51,56,61,13,16,21,26,36,41,46,51,56,61,13,16,21,26,36,41,46,51,56,61,13,16,21,26,36,41,46,51,56,61,13,16,21,26,36,41,46,51,56,61,13,16,21,26,36,41,46,51,56,61,13,16,21,26,36,41,46,51,56,61,13,16,21,26,36,41,46,51,56,61,13,16,21,26,36,41,46,51,56,61,13,16,21,26,36,41,46,51,56,61,13,16,21,26,36,41,46,51,56,61,13,16,21,26,36,41,46,51,56,61,13,16,21,26,36,41,46,51,56,61,13,16,21,26,36,41,46,51,56,61,13,16,21,26,36,41,46,51,56,61,13,16,21,26,36,41,46,51,56,61,13,16,21,26,36,41,46,51,56,61,13,16,21,26,36,41,46,51,56,61,13,16,21,26,36,41,46,51,56,61,13,16,21,26,36,41,46,51,56,61,13,16,21,26,36,41,46,51,56,61,13,16,21,26,36,41,46,51,56,61,5,13,16,21,26,36,41,46,51,56,61,5,13,16,21,26,36,41,46,51,56,61,13,16,21,26,36,41,46,51,56,61,13,16,21,26,36,41,46,51,56,61,13,16,21,26,36,41,46,51,56,61,13,16,21,26,36,41,46,51,56,61,13,16,21,26,36,41,46,51,56,61,5,13,16,21,26,36,41,46,51,56,61,13,16,21,26,36,41,46,51,56,61,13,16,21,26,36,41,46,51,56,61,13,16,21,26,36,41,46,51,56,61,9,13,16,21,26,36,41,46,51,56,61,9,13,16,21,26,36,41,46,51,56,61,16,21,26,36,41,46,51,56,61,3,16,21,26,36,41,46,51,56,61,3,9,13,16,21,26,36,41,46,51,56,61,9,13,16,21,26,36,41,46,51,56,61,9,13,16,21,26,36,41,46,51,56,61,9,13,16,21,26,36,41,46,51,56,61,5,9,13,16,21,26,36,41,46,51,56,61,3,5,16,21,26,36,41,46,51,56,61,3]
[null,null,null,null,null,null,null,null,null,null,null,null,null,null,null,null,null,null,null,null,null,null,null,0,99,null,1,3,null,2,4,null,-1,5,null,-2,6,null,-3,7,null,-4,8,null,-5,9,null,-6,10,null,null,null,null,null,99,3,4,5,6,7,8,9,10,null,99,3,4,5,6,7,8,9,10,null,99,3,4,5,6,7,8,9,10,null,99,3,4,5,6,7,8,9,10,null,99,3,4,5,6,7,8,9,10,null,99,3,4,5,6,7,8,9,10,null,99,3,4,5,6,7,8,9,10,null,0,1,2,-1,-2,-3,-4,-5,-6,null,0,1,2,-1,-2,-3,-4,-5,-6,null,0,1,2,-1,-2,-3,-4,-5,-6,null,0,1,2,-1,-2,-3,-4,-5,-6,null,0,1,2,-1,-2,-3,-4,-5,-6,null,0,1,2,-1,-2,-3,-4,-5,-6,null,0,1,2,-1,-2,-3,-4,-5,-6,null,0,1,2,-1,-2,-3,-4,-5,-6,null,0,1,2,-1,-2,-3,-4,-5,-6,null,0,1,2,-1,-2,-3,-4,-5,-6,null,0,1,2,-1,-2,-3,-4,-5,-6,null,0,1,2,-1,-2,-3,-4,-5,-6,null,0,1,2,-1,-2,-3,-4,-5,-6,null,0,1,2,-1,-2,-3,-4,-5,-6,null,0,1,2,-1,-2,-3,-4,-5,-6,null,0,1,2,-1,-2,-3,-4,-5,-6,null,0,1,2,-1,-2,-3,-4,-5,-6,null,0,1,2,-1,-2,-3,-4,-5,-6,null,null,0,1,2,-1,-2,-3,-4,-5,-6,null,null,99,3,4,5,6,7,8,9,10,null,99,3,4,5,6,7,8,9,10,null,99,3,4,5,6,7,8,9,10,null,99,3,4,5,6,7,8,9,10,null,99,3,4,5,6,7,8,9,10,null,99,3,4,5,6,7,8,9,10,null,null,99,3,4,5,6,7,8,9,10,null,99,3,4,5,6,7,8,9,10,null,99,3,4,5,6,7,8,9,10,null,99,3,4,5,6,7,8,9,10,null,null,0,1,2,-1,-2,-3,-4,-5,-6,null,null,0,1,2,-1,-2,-3,-4,-5,-6,0,1,2,-1,-2,-3,-4,-5,-6,null,0,1,2,-1,-2,-3,-4,-5,-6,null,null,null,0,1,2,-1,-2,-3,-4,-5,-6,null,null,0,1,2,-1,-2,-3,-4,-5,-6,null,null,0,1,2,-1,-2,-3,-4,-5,-6,null,null,0,1,2,-1,-2,-3,-4,-5,-6,null,null,null,0,1,2,-1,-2,-3,-4,-5,-6,null,null,0,1,2,-1,-2,-3,-4,-5,-6,null,null,"A",0,1,2,-1,-2,-3,-4,-5,-6,"B",99,3,4,5,6,7,8,9,10,"合計"]
[null,null,null,null,null,null,null,null,null,null,null,null,null,null,null,null,null,null,null,null,null,null,null,null,null,null,null,null,null,null,null,null,null,null,null,null,null,null,null,null,null,null,null,null,null,null,null,null,null,null,null,null,null,1,{"$f":"BB4","v":1},{"$f":"BC4","v":1},{"$f":"BD4","v":1},{"$f":"BC4&\"a\"","v":"1a"},"1a","1a","1a","1a","1a",{"$f":"BB4+1","v":2},{"$f":"BL4","v":2},{"$f":"BM4","v":2},{"$f":"BN4","v":2},{"$f":"BM4&\"a\"","v":"2a"},"2a","2a","2a","2a","2a",14,{"$f":"BV4","v":14},{"$f":"BW4","v":14},{"$f":"BX4","v":14},{"$f":"BV4&\"a\"","v":"14a"},{"$f":"BZ4","v":"14a"},{"$f":"CA4","v":"14a"},{"$f":"CB4","v":"14a"},{"$f":"CC4","v":"14a"},{"$f":"CD4","v":"14a"},{"$f":"BV4+1","v":15},{"$f":"CF4","v":15},{"$f":"CG4","v":15},{"$f":"CH4","v":15},{"$f":"CF4&\"a\"","v":"15a"},{"$f":"CJ4","v":"15a"},{"$f":"CK4","v":"15a"},{"$f":"CL4","v":"15a"},{"$f":"CM4","v":"15a"},{"$f":"CN4","v":"15a"},{"$f":"CF4+1","v":16},{"$f":"CP4","v":16},{"$f":"CQ4","v":16},{"$f":"CR4","v":16},{"$f":"CP4&\"a\"","v":"16a"},{"$f":"CT4","v":"16a"},{"$f":"CU4","v":"16a"},{"$f":"CV4","v":"16a"},{"$f":"CW4","v":"16a"},{"$f":"CX4","v":"16a"},{"$f":"CP4+1","v":17},{"$f":"CZ4","v":17},{"$f":"DA4","v":17},{"$f":"DB4","v":17},{"$f":"DC4&\"a\"","v":"17a"},{"$f":"DD4","v":"17a"},{"$f":"DE4","v":"17a"},{"$f":"DF4","v":"17a"},{"$f":"DG4","v":"17a"},{"$f":"DH4","v":"17a"},{"$f":"CZ4+1","v":18},{"$f":"DJ4","v":18},{"$f":"DK4","v":18},{"$f":"DL4","v":18},{"$f":"DJ4&\"a\"","v":"18a"},{"$f":"DN4","v":"18a"},{"$f":"DO4","v":"18a"},{"$f":"DP4","v":"18a"},{"$f":"DQ4","v":"18a"},{"$f":"DR4","v":"18a"},{"$f":"DJ4+1","v":19},{"$f":"DT4","v":19},19,19,19,19,19,19,19,19,{"$f":"DT4+1","v":20},{"$f":"ED4","v":20},20,20,20,20,20,20,20,20,{"$f":"ED4+1","v":21},{"$f":"EN4","v":21},21,21,21,21,21,21,21,21,{"$f":"EN4+1","v":22},{"$f":"EX4","v":22},22,22,22,22,22,22,22,22,{"$f":"EX4+1","v":23},{"$f":"FH4","v":23},23,23,23,23,23,23,23,23,{"$f":"FH4+1","v":24},{"$f":"FR4","v":24},24,24,24,24,24,24,24,24,{"$f":"FR4+1","v":25},{"$f":"GB4","v":25},25,25,25,25,25,25,25,25,{"$f":"GB4+1","v":26},{"$f":"GL4","v":26},26,26,26,26,26,26,26,26,{"$f":"GL4+1","v":27},{"$f":"GV4","v":27},27,27,27,27,27,27,27,27,{"$f":"GV4+1","v":28},{"$f":"HF4","v":28},28,28,28,28,28,28,28,28,{"$f":"HF4+1","v":29},{"$f":"HP4","v":29},29,29,29,29,29,29,29,29,{"$f":"HP4+1","v":30},{"$f":"HZ4","v":30},30,30,30,30,30,30,30,30,{"$f":"HZ4+1","v":31},{"$f":"IJ4","v":31},31,31,31,31,31,31,31,31,{"$f":"IJ4+1","v":32},{"$f":"IT4","v":32},32,32,32,32,32,32,32,32,{"$f":"IT4+1","v":33},{"$f":"JD4","v":33},33,33,33,33,33,33,33,33,{"$f":"JD4+1","v":34},{"$f":"JN4","v":34},34,34,34,34,34,34,34,34,{"$f":"JN4+1","v":35},{"$f":"JX4","v":35},35,35,35,35,35,35,35,35,{"$f":"JX4+1","v":36},{"$f":"KH4","v":36},36,36,36,36,36,36,36,36,{"$f":"KQ4&\"a\"","v":"36a"},{"$f":"KH4+1","v":37},{"$f":"KS4","v":37},37,37,37,37,37,37,37,37,{"$f":"LB4&\"a\"","v":"37a"},{"$f":"KS4+1","v":38},{"$f":"LD4","v":38},38,38,38,38,38,38,38,38,{"$f":"LD4+1","v":39},{"$f":"LN4","v":39},39,39,39,39,39,39,39,39,{"$f":"LN4+1","v":40},{"$f":"LX4","v":40},40,40,40,40,40,40,40,40,{"$f":"LX4+1","v":41},{"$f":"MH4","v":41},41,41,41,41,41,41,41,41,{"$f":"MH4+1","v":42},{"$f":"MR4","v":42},42,42,42,42,42,42,42,42,{"$f":"NA4+1","v":43},{"$f":"NB4","v":43},43,43,43,43,43,43,43,43,{"$f":"NK4&\"a\"","v":"43a"},{"$f":"NB4+1","v":44},{"$f":"NM4","v":44},44,44,44,44,44,44,44,44,{"$f":"NV4+1","v":45},{"$f":"NW4","v":45},45,45,45,45,45,45,45,45,{"$f":"OF4+1","v":46},{"$f":"OG4","v":46},46,46,46,46,46,46,46,46,{"$f":"OP4+1","v":47},{"$f":"OQ4","v":47},47,47,47,47,47,47,47,47,{"$f":"OZ4+1","v":48},{"$f":"PA4","v":48},48,48,48,48,48,48,48,48,48,{"$f":"PA4+1","v":49},{"$f":"PL4","v":49},49,49,49,49,49,{"$f":"PQ4","v":49},{"$f":"PR4","v":49},{"$f":"PS4","v":49},{"$f":"PT4","v":49},{"$f":"PL4+1","v":50},{"$f":"PW4","v":50},50,50,50,50,50,50,50,{"$f":"PW4&\"a\"","v":"50a"},{"$f":"PW4+1","v":51},{"$f":"QG4","v":51},51,51,51,51,51,51,51,{"$f":"QG4&\"a\"","v":"51a"},{"$f":"QG4+1","v":52},{"$f":"QQ4","v":52},{"$f":"QR4","v":52},{"$f":"QS4","v":52},{"$f":"QT4","v":52},{"$f":"QU4","v":52},{"$f":"QV4","v":52},52,52,52,52,{"$f":"QQ4+1","v":53},{"$f":"RB4","v":53},{"$f":"RC4","v":53},{"$f":"RD4","v":53},{"$f":"RE4","v":53},{"$f":"RF4","v":53},{"$f":"RG4","v":53},53,53,53,{"$f":"RK4","v":53},{"$f":"RB4+1","v":54},{"$f":"RM4","v":54},54,54,54,54,54,54,54,54,54,{"$f":"RM4+1","v":55},{"$f":"RX4","v":55},{"$f":"RY4","v":55},{"$f":"RZ4","v":55},{"$f":"SA4","v":55},{"$f":"SB4","v":55},{"$f":"SC4","v":55},{"$f":"SD4","v":55},55,55,55,{"$f":"RX4+1","v":56},{"$f":"SI4","v":56},{"$f":"SJ4","v":56},56,{"$f":"SL4","v":56},{"$f":"SM4","v":56},{"$f":"SN4","v":56},{"$f":"SO4","v":56},56,56,56,56,{"$f":"ST4&\"a\"","v":"56a"},{"$f":"SK4+1","v":57},{"$f":"SV4","v":57},57,57,57,57,57,57,57,57,{"$f":"TE4&\"a\"","v":"57a"},null,null,{"$f":"COUNTIF($BB$3:$TF$3,TI3)","v":29},{"$f":"COUNTIF($BB$3:$TF$3,TJ3)","v":29},29,29,29,29,29,29,29,null,17,17,17,17,17,17,17,17,17,{"$f":"COUNTA(BB5:TF5)","v":46}]
[null,null,null,null,null,null,null,null,null,null,null,null,null,null,null,null,null,null,null,null,{"$f":"貸切バス!B57","v":"各種認証・認定の取得状況"},null,null,null,null,null,null,null,null,null,null,null,null,null,null,null,null,null,null,null,null,null,null,null,null,null,null,null,null,null,null,null,null,{"$f":"VLOOKUP(BB4,貸切バス!$C:$F,3,0)","v":"リフト付きバスの導入"},null,null,null,null,null,null,null,null,null,{"$f":"VLOOKUP(BL4,貸切バス!$C:$F,3,0)","v":"エレベーター付きバスの導入"},null,null,null,null,null,null,null,null,null,{"$f":"VLOOKUP(BV4,貸切バス!$C:$F,3,0)","v":"サイクルバスの導入"},null,null,null,null,null,null,null,null,null,{"$f":"VLOOKUP(CF4,貸切バス!$C:$F,3,0)","v":"水陸両用バスの導入"},null,null,null,null,null,null,null,null,null,{"$f":"VLOOKUP(CP4,貸切バス!$C:$F,3,0)","v":"オープントップバスの導入"},null,null,null,null,null,null,null,null,null,{"$f":"VLOOKUP(CZ4,貸切バス!$C:$F,3,0)","v":"訪日外国人旅行者の富裕層向け周遊用バスの導入\n（シート幅の大幅拡張や、伝統工芸を活用した内装を施す等の改造を行った車両）"},null,null,null,null,null,null,null,null,null,{"$f":"VLOOKUP(DJ4,貸切バス!$C:$F,3,0)","v":"上記以外のバスの導入\n（例：レストランバス　仮想現実等の車内でエンターテインメントを提供する車両等）"},null,null,null,null,null,null,null,null,null,{"$f":"VLOOKUP(DT4,貸切バス!$C:$F,3,0)","v":"運行管理支援システム"},null,null,null,null,null,null,null,null,null,{"$f":"VLOOKUP(ED4,貸切バス!$C:$F,3,0)","v":"乗務日報自動作成システム"},null,null,null,null,null,null,null,null,null,{"$f":"VLOOKUP(EN4,貸切バス!$C:$F,3,0)","v":"車両動態管理システム"},null,null,null,null,null,null,null,null,null,{"$f":"VLOOKUP(EX4,貸切バス!$C:$F,3,0)","v":"各種申請書類の作成支援システム"},null,null,null,null,null,null,null,null,null,{"$f":"VLOOKUP(FH4,貸切バス!$C:$F,3,0)","v":"売上・利用者動向分析システム"},null,null,null,null,null,null,null,null,null,{"$f":"VLOOKUP(FR4,貸切バス!$C:$F,3,0)","v":"事故情報管理システム"},null,null,null,null,null,null,null,null,null,{"$f":"VLOOKUP(GB4,貸切バス!$C:$F,3,0)","v":"車検・定期点検・整備管理システム"},null,null,null,null,null,null,null,null,null,{"$f":"VLOOKUP(GL4,貸切バス!$C:$F,3,0)","v":"乗務シフト自動作成システム"},null,null,null,null,null,null,null,null,null,{"$f":"VLOOKUP(GV4,貸切バス!$C:$F,3,0)","v":"勤怠管理システム"},null,null,null,null,null,null,null,null,null,{"$f":"VLOOKUP(HF4,貸切バス!$C:$F,3,0)","v":"営業所・乗務員管理システム"},null,null,null,null,null,null,null,null,null,{"$f":"VLOOKUP(HP4,貸切バス!$C:$F,3,0)","v":"売上集計・記録システム"},null,null,null,null,null,null,null,null,null,{"$f":"VLOOKUP(HZ4,貸切バス!$C:$F,3,0)","v":"会計管理用事務処理系システム"},null,null,null,null,null,null,null,null,null,{"$f":"VLOOKUP(IJ4,貸切バス!$C:$F,3,0)","v":"車内空間を活用したデジタル広告"},null,null,null,null,null,null,null,null,null,{"$f":"VLOOKUP(IT4,貸切バス!$C:$F,3,0)","v":"コールセンターシステム"},null,null,null,null,null,null,null,null,null,{"$f":"VLOOKUP(JD4,貸切バス!$C:$F,3,0)","v":"スマートフォン等モバイル端末を使った集客に繋がる仕組み"},null,null,null,null,null,null,null,null,null,{"$f":"VLOOKUP(JN4,貸切バス!$C:$F,3,0)","v":"デジタルを活用した利用者へのPRや意見収集"},null,null,null,null,null,null,null,null,null,{"$f":"VLOOKUP(JX4,貸切バス!$C:$F,3,0)","v":"車内乗客への遠隔案内システム"},null,null,null,null,null,null,null,null,null,{"$f":"VLOOKUP(KH4,貸切バス!$C:$F,3,0)","v":"その他"},null,null,null,null,null,null,null,null,null,null,{"$f":"VLOOKUP(KS4,貸切バス!$C:$F,3,0)","v":"調査等"},null,null,null,null,null,null,null,null,null,null,{"$f":"VLOOKUP(LD4,貸切バス!$C:$F,3,0)","v":"多言語案内用タブレット"},null,null,null,null,null,null,null,null,null,{"$f":"VLOOKUP(LN4,貸切バス!$C:$F,3,0)","v":"多言語翻訳システム機器"},null,null,null,null,null,null,null,null,null,{"$f":"VLOOKUP(LX4,貸切バス!$C:$F,3,0)","v":"多言語案内サイネージの導入"},null,null,null,null,null,null,null,null,null,{"$f":"VLOOKUP(MH4,貸切バス!$C:$F,3,0)","v":"ホームページの多言語表記"},null,null,null,null,null,null,null,null,null,{"$f":"VLOOKUP(MR4,貸切バス!$C:$F,3,0)","v":"多言語研修の実施"},null,null,null,null,null,null,null,null,null,{"$f":"VLOOKUP(NB4,貸切バス!$C:$F,3,0)","v":"その他"},null,null,null,null,null,null,null,null,null,null,{"$f":"VLOOKUP(NM4,貸切バス!$C:$F,3,0)","v":" 無料公衆無線ＬＡＮ　（無料Ｗｉ-Ｆｉ）"},null,null,null,null,null,null,null,null,null,{"$f":"VLOOKUP(NW4,貸切バス!$C:$F,3,0)","v":"情報端末への電源供給機器"},null,null,null,null,null,null,null,null,null,{"$f":"VLOOKUP(OG4,貸切バス!$C:$F,3,0)","v":"非常用電源装置"},null,null,null,null,null,null,null,null,null,{"$f":"VLOOKUP(OQ4,貸切バス!$C:$F,3,0)","v":"その他付随機器"},null,null,null,null,null,null,null,null,null,{"$f":"VLOOKUP(PA4,貸切バス!$C:$F,3,0)","v":"二種免許取得のための教習"},null,null,null,null,null,null,null,null,null,null,{"$f":"VLOOKUP(PL4,貸切バス!$C:$F,3,0)","v":"二種免許取得のための受験資格特例教習"},null,null,null,null,null,null,null,null,null,null,{"$f":"VLOOKUP(PW4,貸切バス!$C:$F,3,0)","v":"人材確保イベントの参加・開催"},null,null,null,null,null,null,null,null,null,{"$f":"VLOOKUP(QG4,貸切バス!$C:$F,3,0)","v":"その他、人材確保のためのPR"},null,null,null,null,null,null,null,null,null,{"$f":"VLOOKUP(QQ4,貸切バス!$C:$F,3,0)","v":"UD研修"},null,null,null,null,null,null,null,null,null,null,{"$f":"VLOOKUP(RB4,貸切バス!$C:$F,3,0)","v":"観光ドライバー認定講習"},null,null,null,null,null,null,null,null,null,null,{"$f":"VLOOKUP(RM4,貸切バス!$C:$F,3,0)","v":"子育てタクシードライバー研修"},null,null,null,null,null,null,null,null,null,null,{"$f":"VLOOKUP(RX4,貸切バス!$C:$F,3,0)","v":"運転手実技講習"},null,null,null,null,null,null,null,null,null,null,"その他外部研修",null,null,null,null,null,null,null,null,null,null,null,null,"自社研修"]
["整理番号","事業者フラグ","番号","運輸局","支局","事業者名","住所","代表者氏名","ご担当者名","ご連絡先(ＴＥＬ)","ご連絡先(E-mail アドレス)","銀行名","金融機関コード","支店名","支店番号","口座の\n種類","口座番号","フリガナ","口座\n名義人","記載内容に誤りがないこと","働きやすい職場認証制度","えるぼし","くるみんマーク","A：補助対象経費計","B：補助対象経費計","A＋B：補助対象経費計","A：要望額計","B：要望額計","A＋B：要望額計","A：内示額計","B：内示額計","A＋B：内示額計","様式１\nA：交付申請額計","様式１\nB：交付申請額計","様式１\nA+B：交付申請額計","様式２\nA：交付決定額計","様式２\nB：交付決定額計","様式２\nA+B：交付決定額計","様式３\nA：交付決定変更申請額計\n","様式３\nB：交付決定変更申請額計\n","様式３\nA+B：交付決定変更申請額計\n","様式４\nA：交付決定変更額計\n","様式４\nB：交付決定変更額計\n","様式４\nA+B：交付決定変更額計\n","様式６\nA：進捗状況額計\n","様式６\nB：進捗状況額計\n","様式６\nA+B：進捗状況額\n","様式７\nA：完了実績額計\n","様式７\nB：完了実績額計\n","様式７\nA+B：完了実績額計\n","運転者数","車両数","セイフティバス","要望台数","補助対象経費","要望額","内示額","様式１\n交付申請額","様式２\n交付決定額","様式３\n交付決定変更申請額","様式４\n交付決定変更額","様式６\n進捗状況額","様式７\n完了実績額","要望台数","補助対象経費","要望額","内示額","様式１\n交付申請額","様式２\n交付決定額","様式３\n交付決定変更申請額","様式４\n交付決定変更額","様式６\n進捗状況額","様式７\n完了実績額","要望台数","補助対象経費","要望額","内示額","様式１\n交付申請額","様式２\n交付決定額","様式３\n交付決定変更申請額","様式４\n交付決定変更額","様式６\n進捗状況額","様式７\n完了実績額","要望台数","補助対象経費","要望額","内示額","様式１\n交付申請額","様式２\n交付決定額","様式３\n交付決定変更申請額","様式４\n交付決定変更額","様式６\n進捗状況額","様式７\n完了実績額","要望台数","補助対象経費","要望額","内示額","様式１\n交付申請額","様式２\n交付決定額","様式３\n交付決定変更申請額","様式４\n交付決定変更額","様式６\n進捗状況額","様式７\n完了実績額","要望台数","補助対象経費","要望額","内示額","様式１\n交付申請額","様式２\n交付決定額","様式３\n交付決定変更申請額","様式４\n交付決定変更額","様式６\n進捗状況額","様式７\n完了実績額","要望台数","補助対象経費","要望額","内示額","様式１\n交付申請額","様式２\n交付決定額","様式３\n交付決定変更申請額","様式４\n交付決定変更額","様式６\n進捗状況額","様式７\n完了実績額","要望台数","補助対象経費","要望額","内示額","様式１\n交付申請額","様式２\n交付決定額","様式３\n交付決定変更申請額","様式４\n交付決定変更額","様式６\n進捗状況額","様式７\n完了実績額","要望台数","補助対象経費","要望額","内示額","様式１\n交付申請額","様式２\n交付決定額","様式３\n交付決定変更申請額","様式４\n交付決定変更額","様式６\n進捗状況額","様式７\n完了実績額","要望台数","補助対象経費","要望額","内示額","様式１\n交付申請額","様式２\n交付決定額","様式３\n交付決定変更申請額","様式４\n交付決定変更額","様式６\n進捗状況額","様式７\n完了実績額","要望台数","補助対象経費","要望額","内示額","様式１\n交付申請額","様式２\n交付決定額","様式３\n交付決定変更申請額","様式４\n交付決定変更額","様式６\n進捗状況額","様式７\n完了実績額","要望台数","補助対象経費","要望額","内示額","様式１\n交付申請額","様式２\n交付決定額","様式３\n交付決定変更申請額","様式４\n交付決定変更額","様式６\n進捗状況額","様式７\n完了実績額","要望台数","補助対象経費","要望額","内示額","様式１\n交付申請額","様式２\n交付決定額","様式３\n交付決定変更申請額","様式４\n交付決定変更額","様式６\n進捗状況額","様式７\n完了実績額","要望台数","補助対象経費","要望額","内示額","様式１\n交付申請額","様式２\n交付決定額","様式３\n交付決定変更申請額","様式４\n交付決定変更額","様式６\n進捗状況額","様式７\n完了実績額","要望台数","補助対象経費","要望額","内示額","様式１\n交付申請額","様式２\n交付決定額","様式３\n交付決定変更申請額","様式４\n交付決定変更額","様式６\n進捗状況額","様式７\n完了実績額","要望台数","補助対象経費","要望額","内示額","様式１\n交付申請額","様式２\n交付決定額","様式３\n交付決定変更申請額","様式４\n交付決定変更額","様式６\n進捗状況額","様式７\n完了実績額","要望台数","補助対象経費","要望額","内示額","様式１\n交付申請額","様式２\n交付決定額","様式３\n交付決定変更申請額","様式４\n交付決定変更額","様式６\n進捗状況額","様式７\n完了実績額","要望台数","補助対象経費","要望額","内示額","様式１\n交付申請額","様式２\n交付決定額","様式３\n交付決定変更申請額","様式４\n交付決定変更額","様式６\n進捗状況額","様式７\n完了実績額","要望台数","補助対象経費","要望額","内示額","様式１\n交付申請額","様式２\n交付決定額","様式３\n交付決定変更申請額","様式４\n交付決定変更額","様式６\n進捗状況額","様式７\n完了実績額","要望台数","補助対象経費","要望額","内示額","様式１\n交付申請額","様式２\n交付決定額","様式３\n交付決定変更申請額","様式４\n交付決定変更額","様式６\n進捗状況額","様式７\n完了実績額","要望台数","補助対象経費","要望額","内示額","様式１\n交付申請額","様式２\n交付決定額","様式３\n交付決定変更申請額","様式４\n交付決定変更額","様式６\n進捗状況額","様式７\n完了実績額","要望台数","補助対象経費","要望額","内示額","様式１\n交付申請額","様式２\n交付決定額","様式３\n交付決定変更申請額","様式４\n交付決定変更額","様式６\n進捗状況額","様式７\n完了実績額","要望台数","補助対象経費","要望額","内示額","様式１\n交付申請額","様式２\n交付決定額","様式３\n交付決定変更申請額","様式４\n交付決定変更額","様式６\n進捗状況額","様式７\n完了実績額","要望台数","補助対象経費","要望額","内示額","様式１\n交付申請額","様式２\n交付決定額","様式３\n交付決定変更申請額","様式４\n交付決定変更額","様式６\n進捗状況額","様式７\n完了実績額","要望台数","補助対象経費","要望額","内示額","様式１\n交付申請額","様式２\n交付決定額","様式３\n交付決定変更申請額","様式４\n交付決定変更額","様式６\n進捗状況額","様式７\n完了実績額","事業概要","要望台数","補助対象経費","要望額","内示額","様式１\n交付申請額","様式２\n交付決定額","様式３\n交付決定変更申請額","様式４\n交付決定変更額","様式６\n進捗状況額","様式７\n完了実績額","事業概要","要望台数","補助対象経費","要望額","内示額","様式１\n交付申請額","様式２\n交付決定額","様式３\n交付決定変更申請額","様式４\n交付決定変更額","様式６\n進捗状況額","様式７\n完了実績額","要望台数","補助対象経費","要望額","内示額","様式１\n交付申請額","様式２\n交付決定額","様式３\n交付決定変更申請額","様式４\n交付決定変更額","様式６\n進捗状況額","様式７\n完了実績額","要望台数","補助対象経費","要望額","内示額","様式１\n交付申請額","様式２\n交付決定額","様式３\n交付決定変更申請額","様式４\n交付決定変更額","様式６\n進捗状況額","様式７\n完了実績額","要望台数","補助対象経費","要望額","内示額","様式１\n交付申請額","様式２\n交付決定額","様式３\n交付決定変更申請額","様式４\n交付決定変更額","様式６\n進捗状況額","様式７\n完了実績額","要望台数","補助対象経費","要望額","内示額","様式１\n交付申請額","様式２\n交付決定額","様式３\n交付決定変更申請額","様式４\n交付決定変更額","様式６\n進捗状況額","様式７\n完了実績額","要望台数","補助対象経費","要望額","内示額","様式１\n交付申請額","様式２\n交付決定額","様式３\n交付決定変更申請額","様式４\n交付決定変更額","様式６\n進捗状況額","様式７\n完了実績額","事業概要","要望台数","補助対象経費","要望額","内示額","様式１\n交付申請額","様式２\n交付決定額","様式３\n交付決定変更申請額","様式４\n交付決定変更額","様式６\n進捗状況額","様式７\n完了実績額","要望台数","補助対象経費","要望額","内示額","様式１\n交付申請額","様式２\n交付決定額","様式３\n交付決定変更申請額","様式４\n交付決定変更額","様式６\n進捗状況額","様式７\n完了実績額","要望台数","補助対象経費","要望額","内示額","様式１\n交付申請額","様式２\n交付決定額","様式３\n交付決定変更申請額","様式４\n交付決定変更額","様式６\n進捗状況額","様式７\n完了実績額","要望台数","補助対象経費","要望額","内示額","様式１\n交付申請額","様式２\n交付決定額","様式３\n交付決定変更申請額","様式４\n交付決定変更額","様式６\n進捗状況額","様式７\n完了実績額","１人あたり平均経費","要望人数","補助対象経費","要望額","内示額","様式１\n交付申請額","様式２\n交付決定額","様式３\n交付決定変更申請額","様式４\n交付決定変更額","様式６\n進捗状況額","様式７\n完了実績額","１人あたり平均経費","要望人数","補助対象経費","要望額","内示額","様式１\n交付申請額","様式２\n交付決定額","様式３\n交付決定変更申請額","様式４\n交付決定変更額","様式６\n進捗状況額","様式７\n完了実績額","補助対象経費","要望額","内示額","様式１\n交付申請額","様式２\n交付決定額","様式３\n交付決定変更申請額","様式４\n交付決定変更額","様式６\n進捗状況額","様式７\n完了実績額","事業の具体的内容","補助対象経費","要望額","内示額","様式１\n交付申請額","様式２\n交付決定額","様式３\n交付決定変更申請額","様式４\n交付決定変更額","様式６\n進捗状況額","様式７\n完了実績額","事業の具体的内容","１人あたり平均経費","要望人数","補助対象経費","要望額","内示額","様式１\n交付申請額","様式２\n交付決定額","様式３\n交付決定変更申請額","様式４\n交付決定変更額","様式６\n進捗状況額","様式７\n完了実績額","１人あたり平均経費","要望人数","補助対象経費","要望額","内示額","様式１\n交付申請額","様式２\n交付決定額","様式３\n交付決定変更申請額","様式４\n交付決定変更額","様式６\n進捗状況額","様式７\n完了実績額","１人あたり平均経費","要望人数","補助対象経費","要望額","内示額","様式１\n交付申請額","様式２\n交付決定額","様式３\n交付決定変更申請額","様式４\n交付決定変更額","様式６\n進捗状況額","様式７\n完了実績額","１人あたり平均経費","要望人数","補助対象経費","要望額","内示額","様式１\n交付申請額","様式２\n交付決定額","様式３\n交付決定変更申請額","様式４\n交付決定変更額","様式６\n進捗状況額","様式７\n完了実績額","要望項目","１人あたり平均経費","要望人数","補助対象経費","要望額","内示額","様式１\n交付申請額","様式２\n交付決定額","様式３\n交付決定変更申請額","様式４\n交付決定変更額","様式６\n進捗状況額","様式７\n完了実績額","事業の具体的内容","要望項目","補助対象経費","要望額","内示額","様式１\n交付申請額","様式２\n交付決定額","様式３\n交付決定変更申請額","様式４\n交付決定変更額","様式６\n進捗状況額","様式７\n完了実績額","事業の具体的内容"]
[{"$f":"貸切バス!$F$3","v":0},{"$f":"貸切バス!$BN$1","v":0},null,null,null,{"$f":"貸切バス!$F$4","v":0},{"$f":"貸切バス!$M$4","v":0},{"$f":"貸切バス!$F$6","v":0},{"$f":"貸切バス!$M$6","v":0},{"$f":"貸切バス!$F$8","v":0},{"$f":"貸切バス!$M$8","v":0},{"$f":"貸切バス!$F$15","v":0},{"$f":"貸切バス!$M$15","v":0},{"$f":"貸切バス!$F$17","v":0},{"$f":"貸切バス!$F$19","v":0},{"$f":"貸切バス!$F$21","v":0},{"$f":"貸切バス!$F$23","v":0},{"$f":"貸切バス!$F$25","v":0},{"$f":"貸切バス!$F$27","v":0},null,{"$f":"IF(COUNTIF(貸切バス!X66:X70,貸切バス!AD1)=1,VLOOKUP(貸切バス!AD1,貸切バス!X66:AC70,6,0),\"\")","v":""},{"$f":"IF(COUNTIF(貸切バス!X75:X80,貸切バス!AD1)=1,VLOOKUP(貸切バス!AD1,貸切バス!X75:AC80,6,0),\"\")","v":""},{"$f":"IF(COUNTIF(貸切バス!X85:X89,貸切バス!AD1)=1,VLOOKUP(貸切バス!AD1,貸切バス!X85:AC89,6,0),\"\")","v":""},{"$f":"SUMIFS($BB$7:$TF$7,$BB$3:$TF$3,X3)","v":0},{"$f":"SUMIFS($BB$7:$TF$7,$BB$3:$TF$3,Y3)","v":0},{"$f":"X7+Y7","v":0},0,0,{"$f":"AA7+AB7","v":0},0,0,{"$f":"AD7+AE7","v":0},{"$f":"SUMIFS($BB$7:$TF$7,$BB$3:$TF$3,AG3)","v":0},0,{"$f":"AG7+AH7","v":0},0,0,{"$f":"AJ7+AK7","v":0},0,0,{"$f":"AM7+AN7","v":0},0,0,{"$f":"AP7+AQ7","v":0},0,0,{"$f":"AS7+AT7","v":0},0,0,{"$f":"AV7+AW7","v":0},{"$f":"貸切バス!S283","v":0},{"$f":"貸切バス!S284","v":0},{"$f":"IF(COUNTIF(貸切バス!R12:Y12,貸切バス!AD3)=1, IF(貸切バス!R12=\"〇\",4,IF(貸切バス!T12=\"〇\",3,IF(貸切バス!V12=\"〇\",2,IF(貸切バス!X12=\"〇\",1,\"\")))), IFERROR(\"\", \"\"))","v":""},{"$f":"VLOOKUP(BB4,貸切バス!$A:$BI,BB2,0)","v":0},{"$f":"VLOOKUP(BC4,貸切バス!$A:$BI,BC2,0)","v":0},{"$f":"VLOOKUP(BD4,貸切バス!$A:$BI,BD2,0)","v":0},{"$f":"VLOOKUP(BE4,貸切バス!$A:$BI,BE2,0)","v":0},{"$f":"VLOOKUP(BF4,貸切バス!$A:$BI,BF2,0)","v":""},{"$f":"VLOOKUP(BG4,貸切バス!$A:$BI,BG2,0)","v":0},{"$f":"VLOOKUP(BH4,貸切バス!$A:$BI,BH2,0)","v":0},{"$f":"VLOOKUP(BI4,貸切バス!$A:$BI,BI2,0)","v":0},{"$f":"VLOOKUP(BJ4,貸切バス!$A:$BI,BJ2,0)","v":0},{"$f":"VLOOKUP(BK4,貸切バス!$A:$BI,BK2,0)","v":0},{"$f":"VLOOKUP(BL4,貸切バス!$A:$BI,BL2,0)","v":0},{"$f":"VLOOKUP(BM4,貸切バス!$A:$BI,BM2,0)","v":0},{"$f":"VLOOKUP(BN4,貸切バス!$A:$BI,BN2,0)","v":0},{"$f":"VLOOKUP(BO4,貸切バス!$A:$BI,BO2,0)","v":0},{"$f":"VLOOKUP(BP4,貸切バス!$A:$BI,BP2,0)","v":""},{"$f":"VLOOKUP(BQ4,貸切バス!$A:$BI,BQ2,0)","v":0},{"$f":"VLOOKUP(BR4,貸切バス!$A:$BI,BR2,0)","v":0},{"$f":"VLOOKUP(BS4,貸切バス!$A:$BI,BS2,0)","v":0},{"$f":"VLOOKUP(BT4,貸切バス!$A:$BI,BT2,0)","v":0},{"$f":"VLOOKUP(BU4,貸切バス!$A:$BI,BU2,0)","v":0},{"$f":"VLOOKUP(BV4,貸切バス!$A:$BI,BV2,0)","v":0},{"$f":"VLOOKUP(BW4,貸切バス!$A:$BI,BW2,0)","v":0},{"$f":"VLOOKUP(BX4,貸切バス!$A:$BI,BX2,0)","v":0},{"$f":"VLOOKUP(BY4,貸切バス!$A:$BI,BY2,0)","v":0},{"$f":"VLOOKUP(BZ4,貸切バス!$A:$BI,BZ2,0)","v":""},{"$f":"VLOOKUP(CA4,貸切バス!$A:$BI,CA2,0)","v":0},{"$f":"VLOOKUP(CB4,貸切バス!$A:$BI,CB2,0)","v":0},{"$f":"VLOOKUP(CC4,貸切バス!$A:$BI,CC2,0)","v":0},{"$f":"VLOOKUP(CD4,貸切バス!$A:$BI,CD2,0)","v":0},{"$f":"VLOOKUP(CE4,貸切バス!$A:$BI,CE2,0)","v":0},{"$f":"VLOOKUP(CF4,貸切バス!$A:$BI,CF2,0)","v":0},{"$f":"VLOOKUP(CG4,貸切バス!$A:$BI,CG2,0)","v":0},{"$f":"VLOOKUP(CH4,貸切バス!$A:$BI,CH2,0)","v":0},{"$f":"VLOOKUP(CI4,貸切バス!$A:$BI,CI2,0)","v":0},{"$f":"VLOOKUP(CJ4,貸切バス!$A:$BI,CJ2,0)","v":""},{"$f":"VLOOKUP(CK4,貸切バス!$A:$BI,CK2,0)","v":0},{"$f":"VLOOKUP(CL4,貸切バス!$A:$BI,CL2,0)","v":0},{"$f":"VLOOKUP(CM4,貸切バス!$A:$BI,CM2,0)","v":0},{"$f":"VLOOKUP(CN4,貸切バス!$A:$BI,CN2,0)","v":0},{"$f":"VLOOKUP(CO4,貸切バス!$A:$BI,CO2,0)","v":0},{"$f":"VLOOKUP(CP4,貸切バス!$A:$BI,CP2,0)","v":0},{"$f":"VLOOKUP(CQ4,貸切バス!$A:$BI,CQ2,0)","v":0},{"$f":"VLOOKUP(CR4,貸切バス!$A:$BI,CR2,0)","v":0},{"$f":"VLOOKUP(CS4,貸切バス!$A:$BI,CS2,0)","v":0},{"$f":"VLOOKUP(CT4,貸切バス!$A:$BI,CT2,0)","v":""},{"$f":"VLOOKUP(CU4,貸切バス!$A:$BI,CU2,0)","v":0},{"$f":"VLOOKUP(CV4,貸切バス!$A:$BI,CV2,0)","v":0},{"$f":"VLOOKUP(CW4,貸切バス!$A:$BI,CW2,0)","v":0},{"$f":"VLOOKUP(CX4,貸切バス!$A:$BI,CX2,0)","v":0},{"$f":"VLOOKUP(CY4,貸切バス!$A:$BI,CY2,0)","v":0},{"$f":"VLOOKUP(CZ4,貸切バス!$A:$BI,CZ2,0)","v":0},{"$f":"VLOOKUP(DA4,貸切バス!$A:$BI,DA2,0)","v":0},{"$f":"VLOOKUP(DB4,貸切バス!$A:$BI,DB2,0)","v":0},{"$f":"VLOOKUP(DC4,貸切バス!$A:$BI,DC2,0)","v":0},{"$f":"VLOOKUP(DD4,貸切バス!$A:$BI,DD2,0)","v":""},{"$f":"VLOOKUP(DE4,貸切バス!$A:$BI,DE2,0)","v":0},{"$f":"VLOOKUP(DF4,貸切バス!$A:$BI,DF2,0)","v":0},{"$f":"VLOOKUP(DG4,貸切バス!$A:$BI,DG2,0)","v":0},{"$f":"VLOOKUP(DH4,貸切バス!$A:$BI,DH2,0)","v":0},{"$f":"VLOOKUP(DI4,貸切バス!$A:$BI,DI2,0)","v":0},{"$f":"VLOOKUP(DJ4,貸切バス!$A:$BI,DJ2,0)","v":0},{"$f":"VLOOKUP(DK4,貸切バス!$A:$BI,DK2,0)","v":0},{"$f":"VLOOKUP(DL4,貸切バス!$A:$BI,DL2,0)","v":0},{"$f":"VLOOKUP(DM4,貸切バス!$A:$BI,DM2,0)","v":0},{"$f":"VLOOKUP(DN4,貸切バス!$A:$BI,DN2,0)","v":""},{"$f":"VLOOKUP(DO4,貸切バス!$A:$BI,DO2,0)","v":0},{"$f":"VLOOKUP(DP4,貸切バス!$A:$BI,DP2,0)","v":0},{"$f":"VLOOKUP(DQ4,貸切バス!$A:$BI,DQ2,0)","v":0},{"$f":"VLOOKUP(DR4,貸切バス!$A:$BI,DR2,0)","v":0},{"$f":"VLOOKUP(DS4,貸切バス!$A:$BI,DS2,0)","v":0},{"$f":"VLOOKUP(DT4,貸切バス!$A:$BI,DT2,0)","v":0},{"$f":"VLOOKUP(DU4,貸切バス!$A:$BI,DU2,0)","v":0},{"$f":"VLOOKUP(DV4,貸切バス!$A:$BI,DV2,0)","v":0},{"$f":"VLOOKUP(DW4,貸切バス!$A:$BI,DW2,0)","v":0},{"$f":"VLOOKUP(DX4,貸切バス!$A:$BI,DX2,0)","v":""},{"$f":"VLOOKUP(DY4,貸切バス!$A:$BI,DY2,0)","v":0},{"$f":"VLOOKUP(DZ4,貸切バス!$A:$BI,DZ2,0)","v":0},{"$f":"VLOOKUP(EA4,貸切バス!$A:$BI,EA2,0)","v":0},{"$f":"VLOOKUP(EB4,貸切バス!$A:$BI,EB2,0)","v":0},{"$f":"VLOOKUP(EC4,貸切バス!$A:$BI,EC2,0)","v":0},{"$f":"VLOOKUP(ED4,貸切バス!$A:$BI,ED2,0)","v":0},{"$f":"VLOOKUP(EE4,貸切バス!$A:$BI,EE2,0)","v":0},{"$f":"VLOOKUP(EF4,貸切バス!$A:$BI,EF2,0)","v":0},{"$f":"VLOOKUP(EG4,貸切バス!$A:$BI,EG2,0)","v":0},{"$f":"VLOOKUP(EH4,貸切バス!$A:$BI,EH2,0)","v":""},{"$f":"VLOOKUP(EI4,貸切バス!$A:$BI,EI2,0)","v":0},{"$f":"VLOOKUP(EJ4,貸切バス!$A:$BI,EJ2,0)","v":0},{"$f":"VLOOKUP(EK4,貸切バス!$A:$BI,EK2,0)","v":0},{"$f":"VLOOKUP(EL4,貸切バス!$A:$BI,EL2,0)","v":0},{"$f":"VLOOKUP(EM4,貸切バス!$A:$BI,EM2,0)","v":0},{"$f":"VLOOKUP(EN4,貸切バス!$A:$BI,EN2,0)","v":0},{"$f":"VLOOKUP(EO4,貸切バス!$A:$BI,EO2,0)","v":0},{"$f":"VLOOKUP(EP4,貸切バス!$A:$BI,EP2,0)","v":0},{"$f":"VLOOKUP(EQ4,貸切バス!$A:$BI,EQ2,0)","v":0},{"$f":"VLOOKUP(ER4,貸切バス!$A:$BI,ER2,0)","v":""},{"$f":"VLOOKUP(ES4,貸切バス!$A:$BI,ES2,0)","v":0},{"$f":"VLOOKUP(ET4,貸切バス!$A:$BI,ET2,0)","v":0},{"$f":"VLOOKUP(EU4,貸切バス!$A:$BI,EU2,0)","v":0},{"$f":"VLOOKUP(EV4,貸切バス!$A:$BI,EV2,0)","v":0},{"$f":"VLOOKUP(EW4,貸切バス!$A:$BI,EW2,0)","v":0},{"$f":"VLOOKUP(EX4,貸切バス!$A:$BI,EX2,0)","v":0},{"$f":"VLOOKUP(EY4,貸切バス!$A:$BI,EY2,0)","v":0},{"$f":"VLOOKUP(EZ4,貸切バス!$A:$BI,EZ2,0)","v":0},{"$f":"VLOOKUP(FA4,貸切バス!$A:$BI,FA2,0)","v":0},{"$f":"VLOOKUP(FB4,貸切バス!$A:$BI,FB2,0)","v":""},{"$f":"VLOOKUP(FC4,貸切バス!$A:$BI,FC2,0)","v":0},{"$f":"VLOOKUP(FD4,貸切バス!$A:$BI,FD2,0)","v":0},{"$f":"VLOOKUP(FE4,貸切バス!$A:$BI,FE2,0)","v":0},{"$f":"VLOOKUP(FF4,貸切バス!$A:$BI,FF2,0)","v":0},{"$f":"VLOOKUP(FG4,貸切バス!$A:$BI,FG2,0)","v":0},{"$f":"VLOOKUP(FH4,貸切バス!$A:$BI,FH2,0)","v":0},{"$f":"VLOOKUP(FI4,貸切バス!$A:$BI,FI2,0)","v":0},{"$f":"VLOOKUP(FJ4,貸切バス!$A:$BI,FJ2,0)","v":0},{"$f":"VLOOKUP(FK4,貸切バス!$A:$BI,FK2,0)","v":0},{"$f":"VLOOKUP(FL4,貸切バス!$A:$BI,FL2,0)","v":""},{"$f":"VLOOKUP(FM4,貸切バス!$A:$BI,FM2,0)","v":0},{"$f":"VLOOKUP(FN4,貸切バス!$A:$BI,FN2,0)","v":0},{"$f":"VLOOKUP(FO4,貸切バス!$A:$BI,FO2,0)","v":0},{"$f":"VLOOKUP(FP4,貸切バス!$A:$BI,FP2,0)","v":0},{"$f":"VLOOKUP(FQ4,貸切バス!$A:$BI,FQ2,0)","v":0},{"$f":"VLOOKUP(FR4,貸切バス!$A:$BI,FR2,0)","v":0},{"$f":"VLOOKUP(FS4,貸切バス!$A:$BI,FS2,0)","v":0},{"$f":"VLOOKUP(FT4,貸切バス!$A:$BI,FT2,0)","v":0},{"$f":"VLOOKUP(FU4,貸切バス!$A:$BI,FU2,0)","v":0},{"$f":"VLOOKUP(FV4,貸切バス!$A:$BI,FV2,0)","v":""},{"$f":"VLOOKUP(FW4,貸切バス!$A:$BI,FW2,0)","v":0},{"$f":"VLOOKUP(FX4,貸切バス!$A:$BI,FX2,0)","v":0},{"$f":"VLOOKUP(FY4,貸切バス!$A:$BI,FY2,0)","v":0},{"$f":"VLOOKUP(FZ4,貸切バス!$A:$BI,FZ2,0)","v":0},{"$f":"VLOOKUP(GA4,貸切バス!$A:$BI,GA2,0)","v":0},{"$f":"VLOOKUP(GB4,貸切バス!$A:$BI,GB2,0)","v":0},{"$f":"VLOOKUP(GC4,貸切バス!$A:$BI,GC2,0)","v":0},{"$f":"VLOOKUP(GD4,貸切バス!$A:$BI,GD2,0)","v":0},{"$f":"VLOOKUP(GE4,貸切バス!$A:$BI,GE2,0)","v":0},{"$f":"VLOOKUP(GF4,貸切バス!$A:$BI,GF2,0)","v":""},{"$f":"VLOOKUP(GG4,貸切バス!$A:$BI,GG2,0)","v":0},{"$f":"VLOOKUP(GH4,貸切バス!$A:$BI,GH2,0)","v":0},{"$f":"VLOOKUP(GI4,貸切バス!$A:$BI,GI2,0)","v":0},{"$f":"VLOOKUP(GJ4,貸切バス!$A:$BI,GJ2,0)","v":0},{"$f":"VLOOKUP(GK4,貸切バス!$A:$BI,GK2,0)","v":0},{"$f":"VLOOKUP(GL4,貸切バス!$A:$BI,GL2,0)","v":0},{"$f":"VLOOKUP(GM4,貸切バス!$A:$BI,GM2,0)","v":0},{"$f":"VLOOKUP(GN4,貸切バス!$A:$BI,GN2,0)","v":0},{"$f":"VLOOKUP(GO4,貸切バス!$A:$BI,GO2,0)","v":0},{"$f":"VLOOKUP(GP4,貸切バス!$A:$BI,GP2,0)","v":""},{"$f":"VLOOKUP(GQ4,貸切バス!$A:$BI,GQ2,0)","v":0},{"$f":"VLOOKUP(GR4,貸切バス!$A:$BI,GR2,0)","v":0},{"$f":"VLOOKUP(GS4,貸切バス!$A:$BI,GS2,0)","v":0},{"$f":"VLOOKUP(GT4,貸切バス!$A:$BI,GT2,0)","v":0},{"$f":"VLOOKUP(GU4,貸切バス!$A:$BI,GU2,0)","v":0},{"$f":"VLOOKUP(GV4,貸切バス!$A:$BI,GV2,0)","v":0},{"$f":"VLOOKUP(GW4,貸切バス!$A:$BI,GW2,0)","v":0},{"$f":"VLOOKUP(GX4,貸切バス!$A:$BI,GX2,0)","v":0},{"$f":"VLOOKUP(GY4,貸切バス!$A:$BI,GY2,0)","v":0},{"$f":"VLOOKUP(GZ4,貸切バス!$A:$BI,GZ2,0)","v":""},{"$f":"VLOOKUP(HA4,貸切バス!$A:$BI,HA2,0)","v":0},{"$f":"VLOOKUP(HB4,貸切バス!$A:$BI,HB2,0)","v":0},{"$f":"VLOOKUP(HC4,貸切バス!$A:$BI,HC2,0)","v":0},{"$f":"VLOOKUP(HD4,貸切バス!$A:$BI,HD2,0)","v":0},{"$f":"VLOOKUP(HE4,貸切バス!$A:$BI,HE2,0)","v":0},{"$f":"VLOOKUP(HF4,貸切バス!$A:$BI,HF2,0)","v":0},{"$f":"VLOOKUP(HG4,貸切バス!$A:$BI,HG2,0)","v":0},{"$f":"VLOOKUP(HH4,貸切バス!$A:$BI,HH2,0)","v":0},{"$f":"VLOOKUP(HI4,貸切バス!$A:$BI,HI2,0)","v":0},{"$f":"VLOOKUP(HJ4,貸切バス!$A:$BI,HJ2,0)","v":""},{"$f":"VLOOKUP(HK4,貸切バス!$A:$BI,HK2,0)","v":0},{"$f":"VLOOKUP(HL4,貸切バス!$A:$BI,HL2,0)","v":0},{"$f":"VLOOKUP(HM4,貸切バス!$A:$BI,HM2,0)","v":0},{"$f":"VLOOKUP(HN4,貸切バス!$A:$BI,HN2,0)","v":0},{"$f":"VLOOKUP(HO4,貸切バス!$A:$BI,HO2,0)","v":0},{"$f":"VLOOKUP(HP4,貸切バス!$A:$BI,HP2,0)","v":0},{"$f":"VLOOKUP(HQ4,貸切バス!$A:$BI,HQ2,0)","v":0},{"$f":"VLOOKUP(HR4,貸切バス!$A:$BI,HR2,0)","v":0},{"$f":"VLOOKUP(HS4,貸切バス!$A:$BI,HS2,0)","v":0},{"$f":"VLOOKUP(HT4,貸切バス!$A:$BI,HT2,0)","v":""},{"$f":"VLOOKUP(HU4,貸切バス!$A:$BI,HU2,0)","v":0},{"$f":"VLOOKUP(HV4,貸切バス!$A:$BI,HV2,0)","v":0},{"$f":"VLOOKUP(HW4,貸切バス!$A:$BI,HW2,0)","v":0},{"$f":"VLOOKUP(HX4,貸切バス!$A:$BI,HX2,0)","v":0},{"$f":"VLOOKUP(HY4,貸切バス!$A:$BI,HY2,0)","v":0},{"$f":"VLOOKUP(HZ4,貸切バス!$A:$BI,HZ2,0)","v":0},{"$f":"VLOOKUP(IA4,貸切バス!$A:$BI,IA2,0)","v":0},{"$f":"VLOOKUP(IB4,貸切バス!$A:$BI,IB2,0)","v":0},{"$f":"VLOOKUP(IC4,貸切バス!$A:$BI,IC2,0)","v":0},{"$f":"VLOOKUP(ID4,貸切バス!$A:$BI,ID2,0)","v":""},{"$f":"VLOOKUP(IE4,貸切バス!$A:$BI,IE2,0)","v":0},{"$f":"VLOOKUP(IF4,貸切バス!$A:$BI,IF2,0)","v":0},{"$f":"VLOOKUP(IG4,貸切バス!$A:$BI,IG2,0)","v":0},{"$f":"VLOOKUP(IH4,貸切バス!$A:$BI,IH2,0)","v":0},{"$f":"VLOOKUP(II4,貸切バス!$A:$BI,II2,0)","v":0},{"$f":"VLOOKUP(IJ4,貸切バス!$A:$BI,IJ2,0)","v":0},{"$f":"VLOOKUP(IK4,貸切バス!$A:$BI,IK2,0)","v":0},{"$f":"VLOOKUP(IL4,貸切バス!$A:$BI,IL2,0)","v":0},{"$f":"VLOOKUP(IM4,貸切バス!$A:$BI,IM2,0)","v":0},{"$f":"VLOOKUP(IN4,貸切バス!$A:$BI,IN2,0)","v":""},{"$f":"VLOOKUP(IO4,貸切バス!$A:$BI,IO2,0)","v":0},{"$f":"VLOOKUP(IP4,貸切バス!$A:$BI,IP2,0)","v":0},{"$f":"VLOOKUP(IQ4,貸切バス!$A:$BI,IQ2,0)","v":0},{"$f":"VLOOKUP(IR4,貸切バス!$A:$BI,IR2,0)","v":0},{"$f":"VLOOKUP(IS4,貸切バス!$A:$BI,IS2,0)","v":0},{"$f":"VLOOKUP(IT4,貸切バス!$A:$BI,IT2,0)","v":0},{"$f":"VLOOKUP(IU4,貸切バス!$A:$BI,IU2,0)","v":0},{"$f":"VLOOKUP(IV4,貸切バス!$A:$BI,IV2,0)","v":0},{"$f":"VLOOKUP(IW4,貸切バス!$A:$BI,IW2,0)","v":0},{"$f":"VLOOKUP(IX4,貸切バス!$A:$BI,IX2,0)","v":""},{"$f":"VLOOKUP(IY4,貸切バス!$A:$BI,IY2,0)","v":0},{"$f":"VLOOKUP(IZ4,貸切バス!$A:$BI,IZ2,0)","v":0},{"$f":"VLOOKUP(JA4,貸切バス!$A:$BI,JA2,0)","v":0},{"$f":"VLOOKUP(JB4,貸切バス!$A:$BI,JB2,0)","v":0},{"$f":"VLOOKUP(JC4,貸切バス!$A:$BI,JC2,0)","v":0},{"$f":"VLOOKUP(JD4,貸切バス!$A:$BI,JD2,0)","v":0},{"$f":"VLOOKUP(JE4,貸切バス!$A:$BI,JE2,0)","v":0},{"$f":"VLOOKUP(JF4,貸切バス!$A:$BI,JF2,0)","v":0},{"$f":"VLOOKUP(JG4,貸切バス!$A:$BI,JG2,0)","v":0},{"$f":"VLOOKUP(JH4,貸切バス!$A:$BI,JH2,0)","v":""},{"$f":"VLOOKUP(JI4,貸切バス!$A:$BI,JI2,0)","v":0},{"$f":"VLOOKUP(JJ4,貸切バス!$A:$BI,JJ2,0)","v":0},{"$f":"VLOOKUP(JK4,貸切バス!$A:$BI,JK2,0)","v":0},{"$f":"VLOOKUP(JL4,貸切バス!$A:$BI,JL2,0)","v":0},{"$f":"VLOOKUP(JM4,貸切バス!$A:$BI,JM2,0)","v":0},{"$f":"VLOOKUP(JN4,貸切バス!$A:$BI,JN2,0)","v":0},{"$f":"VLOOKUP(JO4,貸切バス!$A:$BI,JO2,0)","v":0},{"$f":"VLOOKUP(JP4,貸切バス!$A:$BI,JP2,0)","v":0},{"$f":"VLOOKUP(JQ4,貸切バス!$A:$BI,JQ2,0)","v":0},{"$f":"VLOOKUP(JR4,貸切バス!$A:$BI,JR2,0)","v":""},{"$f":"VLOOKUP(JS4,貸切バス!$A:$BI,JS2,0)","v":0},{"$f":"VLOOKUP(JT4,貸切バス!$A:$BI,JT2,0)","v":0},{"$f":"VLOOKUP(JU4,貸切バス!$A:$BI,JU2,0)","v":0},{"$f":"VLOOKUP(JV4,貸切バス!$A:$BI,JV2,0)","v":0},{"$f":"VLOOKUP(JW4,貸切バス!$A:$BI,JW2,0)","v":0},{"$f":"VLOOKUP(JX4,貸切バス!$A:$BI,JX2,0)","v":0},{"$f":"VLOOKUP(JY4,貸切バス!$A:$BI,JY2,0)","v":0},{"$f":"VLOOKUP(JZ4,貸切バス!$A:$BI,JZ2,0)","v":0},{"$f":"VLOOKUP(KA4,貸切バス!$A:$BI,KA2,0)","v":0},{"$f":"VLOOKUP(KB4,貸切バス!$A:$BI,KB2,0)","v":""},{"$f":"VLOOKUP(KC4,貸切バス!$A:$BI,KC2,0)","v":0},{"$f":"VLOOKUP(KD4,貸切バス!$A:$BI,KD2,0)","v":0},{"$f":"VLOOKUP(KE4,貸切バス!$A:$BI,KE2,0)","v":0},{"$f":"VLOOKUP(KF4,貸切バス!$A:$BI,KF2,0)","v":0},{"$f":"VLOOKUP(KG4,貸切バス!$A:$BI,KG2,0)","v":0},{"$f":"VLOOKUP(KH4,貸切バス!$A:$BI,KH2,0)","v":0},{"$f":"VLOOKUP(KI4,貸切バス!$A:$BI,KI2,0)","v":0},{"$f":"VLOOKUP(KJ4,貸切バス!$A:$BI,KJ2,0)","v":0},{"$f":"VLOOKUP(KK4,貸切バス!$A:$BI,KK2,0)","v":0},{"$f":"VLOOKUP(KL4,貸切バス!$A:$BI,KL2,0)","v":""},{"$f":"VLOOKUP(KM4,貸切バス!$A:$BI,KM2,0)","v":0},{"$f":"VLOOKUP(KN4,貸切バス!$A:$BI,KN2,0)","v":0},{"$f":"VLOOKUP(KO4,貸切バス!$A:$BI,KO2,0)","v":0},{"$f":"VLOOKUP(KP4,貸切バス!$A:$BI,KP2,0)","v":0},{"$f":"VLOOKUP(KQ4,貸切バス!$A:$BI,KQ2,0)","v":0},{"$f":"VLOOKUP(KR4,貸切バス!$A:$BI,KR2,0)","v":"事業概要："},{"$f":"VLOOKUP(KS4,貸切バス!$A:$BI,KS2,0)","v":0},{"$f":"VLOOKUP(KT4,貸切バス!$A:$BI,KT2,0)","v":0},{"$f":"VLOOKUP(KU4,貸切バス!$A:$BI,KU2,0)","v":0},{"$f":"VLOOKUP(KV4,貸切バス!$A:$BI,KV2,0)","v":0},{"$f":"VLOOKUP(KW4,貸切バス!$A:$BI,KW2,0)","v":""},{"$f":"VLOOKUP(KX4,貸切バス!$A:$BI,KX2,0)","v":0},{"$f":"VLOOKUP(KY4,貸切バス!$A:$BI,KY2,0)","v":0},{"$f":"VLOOKUP(KZ4,貸切バス!$A:$BI,KZ2,0)","v":0},{"$f":"VLOOKUP(LA4,貸切バス!$A:$BI,LA2,0)","v":0},{"$f":"VLOOKUP(LB4,貸切バス!$A:$BI,LB2,0)","v":0},{"$f":"VLOOKUP(LC4,貸切バス!$A:$BI,LC2,0)","v":"事業概要："},{"$f":"VLOOKUP(LD4,貸切バス!$A:$BI,LD2,0)","v":0},{"$f":"VLOOKUP(LE4,貸切バス!$A:$BI,LE2,0)","v":0},{"$f":"VLOOKUP(LF4,貸切バス!$A:$BI,LF2,0)","v":0},{"$f":"VLOOKUP(LG4,貸切バス!$A:$BI,LG2,0)","v":0},{"$f":"VLOOKUP(LH4,貸切バス!$A:$BI,LH2,0)","v":""},{"$f":"VLOOKUP(LI4,貸切バス!$A:$BI,LI2,0)","v":0},{"$f":"VLOOKUP(LJ4,貸切バス!$A:$BI,LJ2,0)","v":0},{"$f":"VLOOKUP(LK4,貸切バス!$A:$BI,LK2,0)","v":0},{"$f":"VLOOKUP(LL4,貸切バス!$A:$BI,LL2,0)","v":0},{"$f":"VLOOKUP(LM4,貸切バス!$A:$BI,LM2,0)","v":0},{"$f":"VLOOKUP(LN4,貸切バス!$A:$BI,LN2,0)","v":0},{"$f":"VLOOKUP(LO4,貸切バス!$A:$BI,LO2,0)","v":0},{"$f":"VLOOKUP(LP4,貸切バス!$A:$BI,LP2,0)","v":0},{"$f":"VLOOKUP(LQ4,貸切バス!$A:$BI,LQ2,0)","v":0},{"$f":"VLOOKUP(LR4,貸切バス!$A:$BI,LR2,0)","v":""},{"$f":"VLOOKUP(LS4,貸切バス!$A:$BI,LS2,0)","v":0},{"$f":"VLOOKUP(LT4,貸切バス!$A:$BI,LT2,0)","v":0},{"$f":"VLOOKUP(LU4,貸切バス!$A:$BI,LU2,0)","v":0},{"$f":"VLOOKUP(LV4,貸切バス!$A:$BI,LV2,0)","v":0},{"$f":"VLOOKUP(LW4,貸切バス!$A:$BI,LW2,0)","v":0},{"$f":"VLOOKUP(LX4,貸切バス!$A:$BI,LX2,0)","v":0},{"$f":"VLOOKUP(LY4,貸切バス!$A:$BI,LY2,0)","v":0},{"$f":"VLOOKUP(LZ4,貸切バス!$A:$BI,LZ2,0)","v":0},{"$f":"VLOOKUP(MA4,貸切バス!$A:$BI,MA2,0)","v":0},{"$f":"VLOOKUP(MB4,貸切バス!$A:$BI,MB2,0)","v":""},{"$f":"VLOOKUP(MC4,貸切バス!$A:$BI,MC2,0)","v":0},{"$f":"VLOOKUP(MD4,貸切バス!$A:$BI,MD2,0)","v":0},{"$f":"VLOOKUP(ME4,貸切バス!$A:$BI,ME2,0)","v":0},{"$f":"VLOOKUP(MF4,貸切バス!$A:$BI,MF2,0)","v":0},{"$f":"VLOOKUP(MG4,貸切バス!$A:$BI,MG2,0)","v":0},{"$f":"VLOOKUP(MH4,貸切バス!$A:$BI,MH2,0)","v":"ー"},{"$f":"VLOOKUP(MI4,貸切バス!$A:$BI,MI2,0)","v":0},{"$f":"VLOOKUP(MJ4,貸切バス!$A:$BI,MJ2,0)","v":0},{"$f":"VLOOKUP(MK4,貸切バス!$A:$BI,MK2,0)","v":0},{"$f":"VLOOKUP(ML4,貸切バス!$A:$BI,ML2,0)","v":""},{"$f":"VLOOKUP(MM4,貸切バス!$A:$BI,MM2,0)","v":0},{"$f":"VLOOKUP(MN4,貸切バス!$A:$BI,MN2,0)","v":0},{"$f":"VLOOKUP(MO4,貸切バス!$A:$BI,MO2,0)","v":0},{"$f":"VLOOKUP(MP4,貸切バス!$A:$BI,MP2,0)","v":0},{"$f":"VLOOKUP(MQ4,貸切バス!$A:$BI,MQ2,0)","v":0},{"$f":"VLOOKUP(MR4,貸切バス!$A:$BI,MR2,0)","v":0},{"$f":"VLOOKUP(MS4,貸切バス!$A:$BI,MS2,0)","v":0},{"$f":"VLOOKUP(MT4,貸切バス!$A:$BI,MT2,0)","v":0},{"$f":"VLOOKUP(MU4,貸切バス!$A:$BI,MU2,0)","v":0},{"$f":"VLOOKUP(MV4,貸切バス!$A:$BI,MV2,0)","v":""},{"$f":"VLOOKUP(MW4,貸切バス!$A:$BI,MW2,0)","v":0},{"$f":"VLOOKUP(MX4,貸切バス!$A:$BI,MX2,0)","v":0},{"$f":"VLOOKUP(MY4,貸切バス!$A:$BI,MY2,0)","v":0},{"$f":"VLOOKUP(MZ4,貸切バス!$A:$BI,MZ2,0)","v":0},{"$f":"VLOOKUP(NA4,貸切バス!$A:$BI,NA2,0)","v":0},{"$f":"VLOOKUP(NB4,貸切バス!$A:$BI,NB2,0)","v":0},{"$f":"VLOOKUP(NC4,貸切バス!$A:$BI,NC2,0)","v":0},{"$f":"VLOOKUP(ND4,貸切バス!$A:$BI,ND2,0)","v":0},{"$f":"VLOOKUP(NE4,貸切バス!$A:$BI,NE2,0)","v":0},{"$f":"VLOOKUP(NF4,貸切バス!$A:$BI,NF2,0)","v":""},{"$f":"VLOOKUP(NG4,貸切バス!$A:$BI,NG2,0)","v":0},{"$f":"VLOOKUP(NH4,貸切バス!$A:$BI,NH2,0)","v":0},{"$f":"VLOOKUP(NI4,貸切バス!$A:$BI,NI2,0)","v":0},{"$f":"VLOOKUP(NJ4,貸切バス!$A:$BI,NJ2,0)","v":0},{"$f":"VLOOKUP(NK4,貸切バス!$A:$BI,NK2,0)","v":0},{"$f":"VLOOKUP(NL4,貸切バス!$A:$BI,NL2,0)","v":"事業概要："},{"$f":"VLOOKUP(NM4,貸切バス!$A:$BI,NM2,0)","v":0},{"$f":"VLOOKUP(NN4,貸切バス!$A:$BI,NN2,0)","v":0},{"$f":"VLOOKUP(NO4,貸切バス!$A:$BI,NO2,0)","v":0},{"$f":"VLOOKUP(NP4,貸切バス!$A:$BI,NP2,0)","v":0},{"$f":"VLOOKUP(NQ4,貸切バス!$A:$BI,NQ2,0)","v":""},{"$f":"VLOOKUP(NR4,貸切バス!$A:$BI,NR2,0)","v":0},{"$f":"VLOOKUP(NS4,貸切バス!$A:$BI,NS2,0)","v":0},{"$f":"VLOOKUP(NT4,貸切バス!$A:$BI,NT2,0)","v":0},{"$f":"VLOOKUP(NU4,貸切バス!$A:$BI,NU2,0)","v":0},{"$f":"VLOOKUP(NV4,貸切バス!$A:$BI,NV2,0)","v":0},{"$f":"VLOOKUP(NW4,貸切バス!$A:$BI,NW2,0)","v":0},{"$f":"VLOOKUP(NX4,貸切バス!$A:$BI,NX2,0)","v":0},{"$f":"VLOOKUP(NY4,貸切バス!$A:$BI,NY2,0)","v":0},{"$f":"VLOOKUP(NZ4,貸切バス!$A:$BI,NZ2,0)","v":0},{"$f":"VLOOKUP(OA4,貸切バス!$A:$BI,OA2,0)","v":""},{"$f":"VLOOKUP(OB4,貸切バス!$A:$BI,OB2,0)","v":0},{"$f":"VLOOKUP(OC4,貸切バス!$A:$BI,OC2,0)","v":0},{"$f":"VLOOKUP(OD4,貸切バス!$A:$BI,OD2,0)","v":0},{"$f":"VLOOKUP(OE4,貸切バス!$A:$BI,OE2,0)","v":0},{"$f":"VLOOKUP(OF4,貸切バス!$A:$BI,OF2,0)","v":0},{"$f":"VLOOKUP(OG4,貸切バス!$A:$BI,OG2,0)","v":0},{"$f":"VLOOKUP(OH4,貸切バス!$A:$BI,OH2,0)","v":0},{"$f":"VLOOKUP(OI4,貸切バス!$A:$BI,OI2,0)","v":0},{"$f":"VLOOKUP(OJ4,貸切バス!$A:$BI,OJ2,0)","v":0},{"$f":"VLOOKUP(OK4,貸切バス!$A:$BI,OK2,0)","v":""},{"$f":"VLOOKUP(OL4,貸切バス!$A:$BI,OL2,0)","v":0},{"$f":"VLOOKUP(OM4,貸切バス!$A:$BI,OM2,0)","v":0},{"$f":"VLOOKUP(ON4,貸切バス!$A:$BI,ON2,0)","v":0},{"$f":"VLOOKUP(OO4,貸切バス!$A:$BI,OO2,0)","v":0},{"$f":"VLOOKUP(OP4,貸切バス!$A:$BI,OP2,0)","v":0},{"$f":"VLOOKUP(OQ4,貸切バス!$A:$BI,OQ2,0)","v":0},{"$f":"VLOOKUP(OR4,貸切バス!$A:$BI,OR2,0)","v":0},{"$f":"VLOOKUP(OS4,貸切バス!$A:$BI,OS2,0)","v":0},{"$f":"VLOOKUP(OT4,貸切バス!$A:$BI,OT2,0)","v":0},{"$f":"VLOOKUP(OU4,貸切バス!$A:$BI,OU2,0)","v":""},{"$f":"VLOOKUP(OV4,貸切バス!$A:$BI,OV2,0)","v":0},{"$f":"VLOOKUP(OW4,貸切バス!$A:$BI,OW2,0)","v":0},{"$f":"VLOOKUP(OX4,貸切バス!$A:$BI,OX2,0)","v":0},{"$f":"VLOOKUP(OY4,貸切バス!$A:$BI,OY2,0)","v":0},{"$f":"VLOOKUP(OZ4,貸切バス!$A:$BI,OZ2,0)","v":0},{"$f":"VLOOKUP(PA4,貸切バス!$A:$BI,PA2,0)","v":"ー"},{"$f":"VLOOKUP(PB4,貸切バス!$A:$BI,PB2,0)","v":0},{"$f":"VLOOKUP(PC4,貸切バス!$A:$BI,PC2,0)","v":0},{"$f":"VLOOKUP(PD4,貸切バス!$A:$BI,PD2,0)","v":0},{"$f":"VLOOKUP(PE4,貸切バス!$A:$BI,PE2,0)","v":0},{"$f":"VLOOKUP(PF4,貸切バス!$A:$BI,PF2,0)","v":""},{"$f":"VLOOKUP(PG4,貸切バス!$A:$BI,PG2,0)","v":0},{"$f":"VLOOKUP(PH4,貸切バス!$A:$BI,PH2,0)","v":0},{"$f":"VLOOKUP(PI4,貸切バス!$A:$BI,PI2,0)","v":0},{"$f":"VLOOKUP(PJ4,貸切バス!$A:$BI,PJ2,0)","v":0},{"$f":"VLOOKUP(PK4,貸切バス!$A:$BI,PK2,0)","v":0},{"$f":"VLOOKUP(PL4,貸切バス!$A:$BI,PL2,0)","v":"ー"},{"$f":"VLOOKUP(PM4,貸切バス!$A:$BI,PM2,0)","v":0},{"$f":"VLOOKUP(PN4,貸切バス!$A:$BI,PN2,0)","v":0},{"$f":"VLOOKUP(PO4,貸切バス!$A:$BI,PO2,0)","v":0},{"$f":"VLOOKUP(PP4,貸切バス!$A:$BI,PP2,0)","v":0},{"$f":"VLOOKUP(PQ4,貸切バス!$A:$BI,PQ2,0)","v":""},{"$f":"VLOOKUP(PR4,貸切バス!$A:$BI,PR2,0)","v":0},{"$f":"VLOOKUP(PS4,貸切バス!$A:$BI,PS2,0)","v":0},{"$f":"VLOOKUP(PT4,貸切バス!$A:$BI,PT2,0)","v":0},{"$f":"VLOOKUP(PU4,貸切バス!$A:$BI,PU2,0)","v":0},{"$f":"VLOOKUP(PV4,貸切バス!$A:$BI,PV2,0)","v":0},{"$f":"VLOOKUP(PW4,貸切バス!$A:$BI,PW2,0)","v":0},{"$f":"VLOOKUP(PX4,貸切バス!$A:$BI,PX2,0)","v":0},{"$f":"VLOOKUP(PY4,貸切バス!$A:$BI,PY2,0)","v":0},{"$f":"VLOOKUP(PZ4,貸切バス!$A:$BI,PZ2,0)","v":""},{"$f":"VLOOKUP(QA4,貸切バス!$A:$BI,QA2,0)","v":0},{"$f":"VLOOKUP(QB4,貸切バス!$A:$BI,QB2,0)","v":0},{"$f":"VLOOKUP(QC4,貸切バス!$A:$BI,QC2,0)","v":0},{"$f":"VLOOKUP(QD4,貸切バス!$A:$BI,QD2,0)","v":0},{"$f":"VLOOKUP(QE4,貸切バス!$A:$BI,QE2,0)","v":0},{"$f":"VLOOKUP(QF4,貸切バス!$A:$BI,QF2,0)","v":0},{"$f":"VLOOKUP(QG4,貸切バス!$A:$BI,QG2,0)","v":0},{"$f":"VLOOKUP(QH4,貸切バス!$A:$BI,QH2,0)","v":0},{"$f":"VLOOKUP(QI4,貸切バス!$A:$BI,QI2,0)","v":0},{"$f":"VLOOKUP(QJ4,貸切バス!$A:$BI,QJ2,0)","v":""},{"$f":"VLOOKUP(QK4,貸切バス!$A:$BI,QK2,0)","v":0},{"$f":"VLOOKUP(QL4,貸切バス!$A:$BI,QL2,0)","v":0},{"$f":"VLOOKUP(QM4,貸切バス!$A:$BI,QM2,0)","v":0},{"$f":"VLOOKUP(QN4,貸切バス!$A:$BI,QN2,0)","v":0},{"$f":"VLOOKUP(QO4,貸切バス!$A:$BI,QO2,0)","v":0},{"$f":"VLOOKUP(QP4,貸切バス!$A:$BI,QP2,0)","v":0},{"$f":"VLOOKUP(QQ4,貸切バス!$A:$BI,QQ2,0)","v":"ー"},{"$f":"VLOOKUP(QR4,貸切バス!$A:$BI,QR2,0)","v":0},{"$f":"VLOOKUP(QS4,貸切バス!$A:$BI,QS2,0)","v":0},{"$f":"VLOOKUP(QT4,貸切バス!$A:$BI,QT2,0)","v":0},{"$f":"VLOOKUP(QU4,貸切バス!$A:$BI,QU2,0)","v":0},{"$f":"VLOOKUP(QV4,貸切バス!$A:$BI,QV2,0)","v":""},{"$f":"VLOOKUP(QW4,貸切バス!$A:$BI,QW2,0)","v":0},{"$f":"VLOOKUP(QX4,貸切バス!$A:$BI,QX2,0)","v":0},{"$f":"VLOOKUP(QY4,貸切バス!$A:$BI,QY2,0)","v":0},{"$f":"VLOOKUP(QZ4,貸切バス!$A:$BI,QZ2,0)","v":0},{"$f":"VLOOKUP(RA4,貸切バス!$A:$BI,RA2,0)","v":0},{"$f":"VLOOKUP(RB4,貸切バス!$A:$BI,RB2,0)","v":"ー"},{"$f":"VLOOKUP(RC4,貸切バス!$A:$BI,RC2,0)","v":0},{"$f":"VLOOKUP(RD4,貸切バス!$A:$BI,RD2,0)","v":0},{"$f":"VLOOKUP(RE4,貸切バス!$A:$BI,RE2,0)","v":0},{"$f":"VLOOKUP(RF4,貸切バス!$A:$BI,RF2,0)","v":0},{"$f":"VLOOKUP(RG4,貸切バス!$A:$BI,RG2,0)","v":""},{"$f":"VLOOKUP(RH4,貸切バス!$A:$BI,RH2,0)","v":0},{"$f":"VLOOKUP(RI4,貸切バス!$A:$BI,RI2,0)","v":0},{"$f":"VLOOKUP(RJ4,貸切バス!$A:$BI,RJ2,0)","v":0},{"$f":"VLOOKUP(RK4,貸切バス!$A:$BI,RK2,0)","v":0},{"$f":"VLOOKUP(RL4,貸切バス!$A:$BI,RL2,0)","v":0},{"$f":"VLOOKUP(RM4,貸切バス!$A:$BI,RM2,0)","v":"ー"},{"$f":"VLOOKUP(RN4,貸切バス!$A:$BI,RN2,0)","v":0},{"$f":"VLOOKUP(RO4,貸切バス!$A:$BI,RO2,0)","v":0},{"$f":"VLOOKUP(RP4,貸切バス!$A:$BI,RP2,0)","v":0},{"$f":"VLOOKUP(RQ4,貸切バス!$A:$BI,RQ2,0)","v":0},{"$f":"VLOOKUP(RR4,貸切バス!$A:$BI,RR2,0)","v":""},{"$f":"VLOOKUP(RS4,貸切バス!$A:$BI,RS2,0)","v":0},{"$f":"VLOOKUP(RT4,貸切バス!$A:$BI,RT2,0)","v":0},{"$f":"VLOOKUP(RU4,貸切バス!$A:$BI,RU2,0)","v":0},{"$f":"VLOOKUP(RV4,貸切バス!$A:$BI,RV2,0)","v":0},{"$f":"VLOOKUP(RW4,貸切バス!$A:$BI,RW2,0)","v":0},{"$f":"VLOOKUP(RX4,貸切バス!$A:$BI,RX2,0)","v":"ー"},{"$f":"VLOOKUP(RY4,貸切バス!$A:$BI,RY2,0)","v":0},{"$f":"VLOOKUP(RZ4,貸切バス!$A:$BI,RZ2,0)","v":0},{"$f":"VLOOKUP(SA4,貸切バス!$A:$BI,SA2,0)","v":0},{"$f":"VLOOKUP(SB4,貸切バス!$A:$BI,SB2,0)","v":0},{"$f":"VLOOKUP(SC4,貸切バス!$A:$BI,SC2,0)","v":""},{"$f":"VLOOKUP(SD4,貸切バス!$A:$BI,SD2,0)","v":0},{"$f":"VLOOKUP(SE4,貸切バス!$A:$BI,SE2,0)","v":0},{"$f":"VLOOKUP(SF4,貸切バス!$A:$BI,SF2,0)","v":0},{"$f":"VLOOKUP(SG4,貸切バス!$A:$BI,SG2,0)","v":0},{"$f":"VLOOKUP(SH4,貸切バス!$A:$BI,SH2,0)","v":0},{"$f":"VLOOKUP(SI4,貸切バス!$A:$BI,SI2,0)","v":0},{"$f":"VLOOKUP(SJ4,貸切バス!$A:$BI,SJ2,0)","v":"ー"},{"$f":"VLOOKUP(SK4,貸切バス!$A:$BI,SK2,0)","v":0},{"$f":"VLOOKUP(SL4,貸切バス!$A:$BI,SL2,0)","v":0},{"$f":"VLOOKUP(SM4,貸切バス!$A:$BI,SM2,0)","v":0},{"$f":"VLOOKUP(SN4,貸切バス!$A:$BI,SN2,0)","v":0},{"$f":"VLOOKUP(SO4,貸切バス!$A:$BI,SO2,0)","v":""},{"$f":"VLOOKUP(SP4,貸切バス!$A:$BI,SP2,0)","v":0},{"$f":"VLOOKUP(SQ4,貸切バス!$A:$BI,SQ2,0)","v":0},{"$f":"VLOOKUP(SR4,貸切バス!$A:$BI,SR2,0)","v":0},{"$f":"VLOOKUP(SS4,貸切バス!$A:$BI,SS2,0)","v":0},{"$f":"VLOOKUP(ST4,貸切バス!$A:$BI,ST2,0)","v":0},{"$f":"VLOOKUP(SU4,貸切バス!$A:$BI,SU2,0)","v":0},{"$f":"VLOOKUP(SV4,貸切バス!$A:$BI,SV2,0)","v":0},{"$f":"VLOOKUP(SW4,貸切バス!$A:$BI,SW2,0)","v":0},{"$f":"VLOOKUP(SX4,貸切バス!$A:$BI,SX2,0)","v":0},{"$f":"VLOOKUP(SY4,貸切バス!$A:$BI,SY2,0)","v":0},{"$f":"VLOOKUP(SZ4,貸切バス!$A:$BI,SZ2,0)","v":""},{"$f":"VLOOKUP(TA4,貸切バス!$A:$BI,TA2,0)","v":0},{"$f":"VLOOKUP(TB4,貸切バス!$A:$BI,TB2,0)","v":0},{"$f":"VLOOKUP(TC4,貸切バス!$A:$BI,TC2,0)","v":0},{"$f":"VLOOKUP(TD4,貸切バス!$A:$BI,TD2,0)","v":0},{"$f":"VLOOKUP(TE4,貸切バス!$A:$BI,TE2,0)","v":0},{"$f":"VLOOKUP(TF4,貸切バス!$A:$BI,TF2,0)","v":0}]

{"sheet":"エラーチェック","index":2,"n_rows":24,"n_cols":548,"rows_kept":24,"cut":false,"hidden":true,"merged":[[4,93,4,102],[4,20,4,22],[4,53,4,62],[4,63,4,72],[4,73,4,82],[4,83,4,92],[4,213,4,222],[4,103,4,112],[4,113,4,122],[4,123,4,132],[4,133,4,142],[4,143,4,152],[4,153,4,162],[4,163,4,172],[4,173,4,182],[4,183,4,192],[4,193,4,202],[4,203,4,212],[4,335,4,344],[4,223,4,232],[4,233,4,242],[4,243,4,252],[4,253,4,262],[4,263,4,272],[4,273,4,282],[4,283,4,292],[4,293,4,303],[4,304,4,314],[4,315,4,324],[4,325,4,334],[4,458,4,468],[4,345,4,354],[4,355,4,364],[4,365,4,375],[4,376,4,385],[4,386,4,395],[4,396,4,405],[4,406,4,415],[4,416,4,426],[4,427,4,437],[4,438,4,447],[4,448,4,457],[4,469,4,479],[4,480,4,490],[4,491,4,501],[4,502,4,508],[4,515,4,525]]}
[1,2,3,4,5,6,7,8,9,10,11,12,13,14,15,16,17,18,19,20,21,22,23,24,25,26,27,28,29,30,31,32,33,34,35,36,37,38,39,40,41,42,43,44,45,46,47,48,49,50,51,52,53,54,55,56,57,58,59,60,61,62,63,64,65,66,67,68,69,70,71,72,73,74,75,76,77,78,79,80,81,82,83,84,85,86,87,88,89,90,91,92,93,94,95,96,97,98,99,100,101,102,103,104,105,106,107,108,109,110,111,112,113,114,115,116,117,118,119,120,121,122,123,124,125,126,127,128,129,130,131,132,133,134,135,136,137,138,139,140,141,142,143,144,145,146,147,148,149,150,151,152,153,154,155,156,157,158,159,160,161,162,163,164,165,166,167,168,169,170,171,172,173,174,175,176,177,178,179,180,181,182,183,184,185,186,187,188,189,190,191,192,193,194,195,196,197,198,199,200,201,202,203,204,205,206,207,208,209,210,211,212,213,214,215,216,217,218,219,220,221,222,223,224,225,226,227,228,229,230,231,232,233,234,235,236,237,238,239,240,241,242,243,244,245,246,247,248,249,250,251,252,253,254,255,256,257,258,259,260,261,262,263,264,265,266,267,268,269,270,271,272,273,274,275,276,277,278,279,280,281,282,283,284,285,286,287,288,289,290,291,292,293,294,295,296,297,298,299,300,301,302,303,304,305,306,307,308,309,310,311,312,313,314,315,316,317,318,319,320,321,322,323,324,325,326,327,328,329,330,331,332,333,334,335,336,337,338,339,340,341,342,343,344,345,346,347,348,349,350,351,352,353,354,355,356,357,358,359,360,361,362,363,364,365,366,367,368,369,370,371,372,373,374,375,376,377,378,379,380,381,382,383,384,385,386,387,388,389,390,391,392,393,394,395,396,397,398,399,400,401,402,403,404,405,406,407,408,409,410,411,412,413,414,415,416,417,418,419,420,421,422,423,424,425,426,427,428,429,430,431,432,433,434,435,436,437,438,439,440,441,442,443,444,445,446,447,448,449,450,451,452,453,454,455,456,457,458,459,460,461,462,463,464,465,466,467,468,469,470,471,472,473,474,475,476,477,478,479,480,481,482,483,484,485,486,487,488,489,490,491,492,493,494,495,496,497,498,499,500,501,502,503,504,505,506,507,508,509,510,511,512,513,514,515,516,517,518,519,520,521,522,523,524,525,526]
[null,null,null,null,null,null,null,null,null,null,null,null,null,null,null,null,null,null,null,null,null,null,null,null,null,null,null,null,null,null,null,null,null,null,null,null,null,null,null,null,null,null,null,null,null,null,null,null,null,null,null,null,null,13,16,21,26,36,41,46,51,56,61,13,16,21,26,36,41,46,51,56,61,13,16,21,26,36,41,46,51,56,61,13,16,21,26,36,41,46,51,56,61,13,16,21,26,36,41,46,51,56,61,13,16,21,26,36,41,46,51,56,61,13,16,21,26,36,41,46,51,56,61,13,16,21,26,36,41,46,51,56,61,13,16,21,26,36,41,46,51,56,61,13,16,21,26,36,41,46,51,56,61,13,16,21,26,36,41,46,51,56,61,13,16,21,26,36,41,46,51,56,61,13,16,21,26,36,41,46,51,56,61,13,16,21,26,36,41,46,51,56,61,13,16,21,26,36,41,46,51,56,61,13,16,21,26,36,41,46,51,56,61,13,16,21,26,36,41,46,51,56,61,13,16,21,26,36,41,46,51,56,61,13,16,21,26,36,41,46,51,56,61,13,16,21,26,36,41,46,51,56,61,13,16,21,26,36,41,46,51,56,61,13,16,21,26,36,41,46,51,56,61,13,16,21,26,36,41,46,51,56,61,13,16,21,26,36,41,46,51,56,61,13,16,21,26,36,41,46,51,56,61,5,13,16,21,26,36,41,46,51,56,61,5,13,16,21,26,36,41,46,51,56,61,13,16,21,26,36,41,46,51,56,61,13,16,21,26,36,41,46,51,56,61,13,16,21,26,36,41,46,51,56,61,13,16,21,26,36,41,46,51,56,61,13,16,21,26,36,41,46,51,56,61,5,13,16,21,26,36,41,46,51,56,61,13,16,21,26,36,41,46,51,56,61,13,16,21,26,36,41,46,51,56,61,13,16,21,26,36,41,46,51,56,61,9,13,16,21,26,36,41,46,51,56,61,9,13,16,21,26,36,41,46,51,56,61,16,21,26,36,41,46,51,56,61,3,16,21,26,36,41,46,51,56,61,3,9,13,16,21,26,36,41,46,51,56,61,9,13,16,21,26,36,41,46,51,56,61,9,13,16,21,26,36,41,46,51,56,61,9,13,16,21,26,36,41,46,51,56,61,5,9,13,16,21,26,36,41,46,51,56,61,3,5,16,21,26,36,41,46,51,56,61,3]
[null,null,null,null,null,null,null,null,null,null,null,null,null,null,null,null,null,null,null,null,null,null,null,0,99,null,1,3,null,2,4,null,-1,5,null,-2,6,null,-3,7,null,-4,8,null,-5,9,null,-6,10,null,null,null,null,null,99,3,4,5,6,7,8,9,10,null,99,3,4,5,6,7,8,9,10,null,99,3,4,5,6,7,8,9,10,null,99,3,4,5,6,7,8,9,10,null,99,3,4,5,6,7,8,9,10,null,99,3,4,5,6,7,8,9,10,null,99,3,4,5,6,7,8,9,10,null,0,1,2,-1,-2,-3,-4,-5,-6,null,0,1,2,-1,-2,-3,-4,-5,-6,null,0,1,2,-1,-2,-3,-4,-5,-6,null,0,1,2,-1,-2,-3,-4,-5,-6,null,0,1,2,-1,-2,-3,-4,-5,-6,null,0,1,2,-1,-2,-3,-4,-5,-6,null,0,1,2,-1,-2,-3,-4,-5,-6,null,0,1,2,-1,-2,-3,-4,-5,-6,null,0,1,2,-1,-2,-3,-4,-5,-6,null,0,1,2,-1,-2,-3,-4,-5,-6,null,0,1,2,-1,-2,-3,-4,-5,-6,null,0,1,2,-1,-2,-3,-4,-5,-6,null,0,1,2,-1,-2,-3,-4,-5,-6,null,0,1,2,-1,-2,-3,-4,-5,-6,null,0,1,2,-1,-2,-3,-4,-5,-6,null,0,1,2,-1,-2,-3,-4,-5,-6,null,0,1,2,-1,-2,-3,-4,-5,-6,null,0,1,2,-1,-2,-3,-4,-5,-6,null,null,0,1,2,-1,-2,-3,-4,-5,-6,null,null,99,3,4,5,6,7,8,9,10,null,99,3,4,5,6,7,8,9,10,null,99,3,4,5,6,7,8,9,10,null,99,3,4,5,6,7,8,9,10,null,99,3,4,5,6,7,8,9,10,null,99,3,4,5,6,7,8,9,10,null,null,99,3,4,5,6,7,8,9,10,null,99,3,4,5,6,7,8,9,10,null,99,3,4,5,6,7,8,9,10,null,99,3,4,5,6,7,8,9,10,null,null,0,1,2,-1,-2,-3,-4,-5,-6,null,null,0,1,2,-1,-2,-3,-4,-5,-6,0,1,2,-1,-2,-3,-4,-5,-6,null,0,1,2,-1,-2,-3,-4,-5,-6,null,null,null,0,1,2,-1,-2,-3,-4,-5,-6,null,null,0,1,2,-1,-2,-3,-4,-5,-6,null,null,0,1,2,-1,-2,-3,-4,-5,-6,null,null,0,1,2,-1,-2,-3,-4,-5,-6,null,null,null,0,1,2,-1,-2,-3,-4,-5,-6,null,null,0,1,2,-1,-2,-3,-4,-5,-6,null,null,"A",0,1,2,-1,-2,-3,-4,-5,-6,"B",99,3,4,5,6,7,8,9,10,"合計"]
[null,null,null,null,null,null,null,null,null,null,null,null,null,null,null,null,null,null,null,null,null,null,null,null,null,null,null,null,null,null,null,null,null,null,null,null,null,null,null,null,null,null,null,null,null,null,null,null,null,null,null,null,null,1,{"$f":"BB4","v":1},{"$f":"BC4","v":1},{"$f":"BD4","v":1},{"$f":"BC4&\"a\"","v":"1a"},"1a","1a","1a","1a","1a",{"$f":"BB4+1","v":2},{"$f":"BL4","v":2},{"$f":"BM4","v":2},{"$f":"BN4","v":2},{"$f":"BM4&\"a\"","v":"2a"},"2a","2a","2a","2a","2a",14,{"$f":"BV4","v":14},{"$f":"BW4","v":14},{"$f":"BX4","v":14},{"$f":"BV4&\"a\"","v":"14a"},{"$f":"BZ4","v":"14a"},{"$f":"CA4","v":"14a"},{"$f":"CB4","v":"14a"},{"$f":"CC4","v":"14a"},{"$f":"CD4","v":"14a"},{"$f":"BV4+1","v":15},{"$f":"CF4","v":15},{"$f":"CG4","v":15},{"$f":"CH4","v":15},{"$f":"CF4&\"a\"","v":"15a"},{"$f":"CJ4","v":"15a"},{"$f":"CK4","v":"15a"},{"$f":"CL4","v":"15a"},{"$f":"CM4","v":"15a"},{"$f":"CN4","v":"15a"},{"$f":"CF4+1","v":16},{"$f":"CP4","v":16},{"$f":"CQ4","v":16},{"$f":"CR4","v":16},{"$f":"CP4&\"a\"","v":"16a"},{"$f":"CT4","v":"16a"},{"$f":"CU4","v":"16a"},{"$f":"CV4","v":"16a"},{"$f":"CW4","v":"16a"},{"$f":"CX4","v":"16a"},{"$f":"CP4+1","v":17},{"$f":"CZ4","v":17},{"$f":"DA4","v":17},{"$f":"DB4","v":17},{"$f":"DC4&\"a\"","v":"17a"},{"$f":"DD4","v":"17a"},{"$f":"DE4","v":"17a"},{"$f":"DF4","v":"17a"},{"$f":"DG4","v":"17a"},{"$f":"DH4","v":"17a"},{"$f":"CZ4+1","v":18},{"$f":"DJ4","v":18},{"$f":"DK4","v":18},{"$f":"DL4","v":18},{"$f":"DJ4&\"a\"","v":"18a"},{"$f":"DN4","v":"18a"},{"$f":"DO4","v":"18a"},{"$f":"DP4","v":"18a"},{"$f":"DQ4","v":"18a"},{"$f":"DR4","v":"18a"},{"$f":"DJ4+1","v":19},{"$f":"DT4","v":19},19,19,19,19,19,19,19,19,{"$f":"DT4+1","v":20},{"$f":"ED4","v":20},20,20,20,20,20,20,20,20,{"$f":"ED4+1","v":21},{"$f":"EN4","v":21},21,21,21,21,21,21,21,21,{"$f":"EN4+1","v":22},{"$f":"EX4","v":22},22,22,22,22,22,22,22,22,{"$f":"EX4+1","v":23},{"$f":"FH4","v":23},23,23,23,23,23,23,23,23,{"$f":"FH4+1","v":24},{"$f":"FR4","v":24},24,24,24,24,24,24,24,24,{"$f":"FR4+1","v":25},{"$f":"GB4","v":25},25,25,25,25,25,25,25,25,{"$f":"GB4+1","v":26},{"$f":"GL4","v":26},26,26,26,26,26,26,26,26,{"$f":"GL4+1","v":27},{"$f":"GV4","v":27},27,27,27,27,27,27,27,27,{"$f":"GV4+1","v":28},{"$f":"HF4","v":28},28,28,28,28,28,28,28,28,{"$f":"HF4+1","v":29},{"$f":"HP4","v":29},29,29,29,29,29,29,29,29,{"$f":"HP4+1","v":30},{"$f":"HZ4","v":30},30,30,30,30,30,30,30,30,{"$f":"HZ4+1","v":31},{"$f":"IJ4","v":31},31,31,31,31,31,31,31,31,{"$f":"IJ4+1","v":32},{"$f":"IT4","v":32},32,32,32,32,32,32,32,32,{"$f":"IT4+1","v":33},{"$f":"JD4","v":33},33,33,33,33,33,33,33,33,{"$f":"JD4+1","v":34},{"$f":"JN4","v":34},34,34,34,34,34,34,34,34,{"$f":"JN4+1","v":35},{"$f":"JX4","v":35},35,35,35,35,35,35,35,35,{"$f":"JX4+1","v":36},{"$f":"KH4","v":36},36,36,36,36,36,36,36,36,{"$f":"KQ4&\"a\"","v":"36a"},{"$f":"KH4+1","v":37},{"$f":"KS4","v":37},37,37,37,37,37,37,37,37,{"$f":"LB4&\"a\"","v":"37a"},{"$f":"KS4+1","v":38},{"$f":"LD4","v":38},38,38,38,38,38,38,38,38,{"$f":"LD4+1","v":39},{"$f":"LN4","v":39},39,39,39,39,39,39,39,39,{"$f":"LN4+1","v":40},{"$f":"LX4","v":40},40,40,40,40,40,40,40,40,{"$f":"LX4+1","v":41},{"$f":"MH4","v":41},41,41,41,41,41,41,41,41,{"$f":"MH4+1","v":42},{"$f":"MR4","v":42},42,42,42,42,42,42,42,42,{"$f":"NA4+1","v":43},{"$f":"NB4","v":43},43,43,43,43,43,43,43,43,{"$f":"NK4&\"a\"","v":"43a"},{"$f":"NB4+1","v":44},{"$f":"NM4","v":44},44,44,44,44,44,44,44,44,{"$f":"NV4+1","v":45},{"$f":"NW4","v":45},45,45,45,45,45,45,45,45,{"$f":"OF4+1","v":46},{"$f":"OG4","v":46},46,46,46,46,46,46,46,46,{"$f":"OP4+1","v":47},{"$f":"OQ4","v":47},47,47,47,47,47,47,47,47,{"$f":"OZ4+1","v":48},{"$f":"PA4","v":48},48,48,48,48,48,48,48,48,48,{"$f":"PA4+1","v":49},{"$f":"PL4","v":49},49,49,49,49,49,{"$f":"PQ4","v":49},{"$f":"PR4","v":49},{"$f":"PS4","v":49},{"$f":"PT4","v":49},{"$f":"PL4+1","v":50},{"$f":"PW4","v":50},50,50,50,50,50,50,50,{"$f":"PW4&\"a\"","v":"50a"},{"$f":"PW4+1","v":51},{"$f":"QG4","v":51},51,51,51,51,51,51,51,{"$f":"QG4&\"a\"","v":"51a"},{"$f":"QG4+1","v":52},{"$f":"QQ4","v":52},{"$f":"QR4","v":52},{"$f":"QS4","v":52},{"$f":"QT4","v":52},{"$f":"QU4","v":52},{"$f":"QV4","v":52},52,52,52,52,{"$f":"QQ4+1","v":53},{"$f":"RB4","v":53},{"$f":"RC4","v":53},{"$f":"RD4","v":53},{"$f":"RE4","v":53},{"$f":"RF4","v":53},{"$f":"RG4","v":53},53,53,53,{"$f":"RK4","v":53},{"$f":"RB4+1","v":54},{"$f":"RM4","v":54},54,54,54,54,54,54,54,54,54,{"$f":"RM4+1","v":55},{"$f":"RX4","v":55},{"$f":"RY4","v":55},{"$f":"RZ4","v":55},{"$f":"SA4","v":55},{"$f":"SB4","v":55},{"$f":"SC4","v":55},{"$f":"SD4","v":55},55,55,55,{"$f":"RX4+1","v":56},{"$f":"SI4","v":56},{"$f":"SJ4","v":56},56,{"$f":"SL4","v":56},{"$f":"SM4","v":56},{"$f":"SN4","v":56},{"$f":"SO4","v":56},56,56,56,56,{"$f":"ST4&\"a\"","v":"56a"},{"$f":"SK4+1","v":57},{"$f":"SV4","v":57},57,57,57,57,57,57,57,57,{"$f":"TE4&\"a\"","v":"57a"},null,null,{"$f":"COUNTIF($BB$3:$TF$3,TI3)","v":29},{"$f":"COUNTIF($BB$3:$TF$3,TJ3)","v":29},29,29,29,29,29,29,29,null,17,17,17,17,17,17,17,17,17,{"$f":"COUNTA(BB5:TF5)","v":46}]
[null,null,null,null,null,null,null,null,null,null,null,null,null,null,null,null,null,null,null,null,{"$f":"貸切バス!B57","v":"各種認証・認定の取得状況"},null,null,null,null,null,null,null,null,null,null,null,null,null,null,null,null,null,null,null,null,null,null,null,null,null,null,null,null,null,null,null,null,{"$f":"VLOOKUP(BB4,貸切バス!$C:$F,3,0)","v":"リフト付きバスの導入"},null,null,null,null,null,null,null,null,null,{"$f":"VLOOKUP(BL4,貸切バス!$C:$F,3,0)","v":"エレベーター付きバスの導入"},null,null,null,null,null,null,null,null,null,{"$f":"VLOOKUP(BV4,貸切バス!$C:$F,3,0)","v":"サイクルバスの導入"},null,null,null,null,null,null,null,null,null,{"$f":"VLOOKUP(CF4,貸切バス!$C:$F,3,0)","v":"水陸両用バスの導入"},null,null,null,null,null,null,null,null,null,{"$f":"VLOOKUP(CP4,貸切バス!$C:$F,3,0)","v":"オープントップバスの導入"},null,null,null,null,null,null,null,null,null,{"$f":"VLOOKUP(CZ4,貸切バス!$C:$F,3,0)","v":"訪日外国人旅行者の富裕層向け周遊用バスの導入\n（シート幅の大幅拡張や、伝統工芸を活用した内装を施す等の改造を行った車両）"},null,null,null,null,null,null,null,null,null,{"$f":"VLOOKUP(DJ4,貸切バス!$C:$F,3,0)","v":"上記以外のバスの導入\n（例：レストランバス　仮想現実等の車内でエンターテインメントを提供する車両等）"},null,null,null,null,null,null,null,null,null,{"$f":"VLOOKUP(DT4,貸切バス!$C:$F,3,0)","v":"運行管理支援システム"},null,null,null,null,null,null,null,null,null,{"$f":"VLOOKUP(ED4,貸切バス!$C:$F,3,0)","v":"乗務日報自動作成システム"},null,null,null,null,null,null,null,null,null,{"$f":"VLOOKUP(EN4,貸切バス!$C:$F,3,0)","v":"車両動態管理システム"},null,null,null,null,null,null,null,null,null,{"$f":"VLOOKUP(EX4,貸切バス!$C:$F,3,0)","v":"各種申請書類の作成支援システム"},null,null,null,null,null,null,null,null,null,{"$f":"VLOOKUP(FH4,貸切バス!$C:$F,3,0)","v":"売上・利用者動向分析システム"},null,null,null,null,null,null,null,null,null,{"$f":"VLOOKUP(FR4,貸切バス!$C:$F,3,0)","v":"事故情報管理システム"},null,null,null,null,null,null,null,null,null,{"$f":"VLOOKUP(GB4,貸切バス!$C:$F,3,0)","v":"車検・定期点検・整備管理システム"},null,null,null,null,null,null,null,null,null,{"$f":"VLOOKUP(GL4,貸切バス!$C:$F,3,0)","v":"乗務シフト自動作成システム"},null,null,null,null,null,null,null,null,null,{"$f":"VLOOKUP(GV4,貸切バス!$C:$F,3,0)","v":"勤怠管理システム"},null,null,null,null,null,null,null,null,null,{"$f":"VLOOKUP(HF4,貸切バス!$C:$F,3,0)","v":"営業所・乗務員管理システム"},null,null,null,null,null,null,null,null,null,{"$f":"VLOOKUP(HP4,貸切バス!$C:$F,3,0)","v":"売上集計・記録システム"},null,null,null,null,null,null,null,null,null,{"$f":"VLOOKUP(HZ4,貸切バス!$C:$F,3,0)","v":"会計管理用事務処理系システム"},null,null,null,null,null,null,null,null,null,{"$f":"VLOOKUP(IJ4,貸切バス!$C:$F,3,0)","v":"車内空間を活用したデジタル広告"},null,null,null,null,null,null,null,null,null,{"$f":"VLOOKUP(IT4,貸切バス!$C:$F,3,0)","v":"コールセンターシステム"},null,null,null,null,null,null,null,null,null,{"$f":"VLOOKUP(JD4,貸切バス!$C:$F,3,0)","v":"スマートフォン等モバイル端末を使った集客に繋がる仕組み"},null,null,null,null,null,null,null,null,null,{"$f":"VLOOKUP(JN4,貸切バス!$C:$F,3,0)","v":"デジタルを活用した利用者へのPRや意見収集"},null,null,null,null,null,null,null,null,null,{"$f":"VLOOKUP(JX4,貸切バス!$C:$F,3,0)","v":"車内乗客への遠隔案内システム"},null,null,null,null,null,null,null,null,null,{"$f":"VLOOKUP(KH4,貸切バス!$C:$F,3,0)","v":"その他"},null,null,null,null,null,null,null,null,null,null,{"$f":"VLOOKUP(KS4,貸切バス!$C:$F,3,0)","v":"調査等"},null,null,null,null,null,null,null,null,null,null,{"$f":"VLOOKUP(LD4,貸切バス!$C:$F,3,0)","v":"多言語案内用タブレット"},null,null,null,null,null,null,null,null,null,{"$f":"VLOOKUP(LN4,貸切バス!$C:$F,3,0)","v":"多言語翻訳システム機器"},null,null,null,null,null,null,null,null,null,{"$f":"VLOOKUP(LX4,貸切バス!$C:$F,3,0)","v":"多言語案内サイネージの導入"},null,null,null,null,null,null,null,null,null,{"$f":"VLOOKUP(MH4,貸切バス!$C:$F,3,0)","v":"ホームページの多言語表記"},null,null,null,null,null,null,null,null,null,{"$f":"VLOOKUP(MR4,貸切バス!$C:$F,3,0)","v":"多言語研修の実施"},null,null,null,null,null,null,null,null,null,{"$f":"VLOOKUP(NB4,貸切バス!$C:$F,3,0)","v":"その他"},null,null,null,null,null,null,null,null,null,null,{"$f":"VLOOKUP(NM4,貸切バス!$C:$F,3,0)","v":" 無料公衆無線ＬＡＮ　（無料Ｗｉ-Ｆｉ）"},null,null,null,null,null,null,null,null,null,{"$f":"VLOOKUP(NW4,貸切バス!$C:$F,3,0)","v":"情報端末への電源供給機器"},null,null,null,null,null,null,null,null,null,{"$f":"VLOOKUP(OG4,貸切バス!$C:$F,3,0)","v":"非常用電源装置"},null,null,null,null,null,null,null,null,null,{"$f":"VLOOKUP(OQ4,貸切バス!$C:$F,3,0)","v":"その他付随機器"},null,null,null,null,null,null,null,null,null,{"$f":"VLOOKUP(PA4,貸切バス!$C:$F,3,0)","v":"二種免許取得のための教習"},null,null,null,null,null,null,null,null,null,null,{"$f":"VLOOKUP(PL4,貸切バス!$C:$F,3,0)","v":"二種免許取得のための受験資格特例教習"},null,null,null,null,null,null,null,null,null,null,{"$f":"VLOOKUP(PW4,貸切バス!$C:$F,3,0)","v":"人材確保イベントの参加・開催"},null,null,null,null,null,null,null,null,null,{"$f":"VLOOKUP(QG4,貸切バス!$C:$F,3,0)","v":"その他、人材確保のためのPR"},null,null,null,null,null,null,null,null,null,{"$f":"VLOOKUP(QQ4,貸切バス!$C:$F,3,0)","v":"UD研修"},null,null,null,null,null,null,null,null,null,null,{"$f":"VLOOKUP(RB4,貸切バス!$C:$F,3,0)","v":"観光ドライバー認定講習"},null,null,null,null,null,null,null,null,null,null,{"$f":"VLOOKUP(RM4,貸切バス!$C:$F,3,0)","v":"子育てタクシードライバー研修"},null,null,null,null,null,null,null,null,null,null,{"$f":"VLOOKUP(RX4,貸切バス!$C:$F,3,0)","v":"運転手実技講習"},null,null,null,null,null,null,null,null,null,null,"その他外部研修",null,null,null,null,null,null,null,null,null,null,null,null,"自社研修"]
["整理番号","事業者フラグ","番号","運輸局","支局","事業者名","住所","代表者氏名","ご担当者名","ご連絡先(ＴＥＬ)","ご連絡先(E-mail アドレス)","銀行名","金融機関コード","支店名","支店番号","口座の\n種類","口座番号","フリガナ","口座\n名義人","記載内容に誤りがないこと","働きやすい職場認証制度","えるぼし","くるみんマーク","A：補助対象経費計","B：補助対象経費計","A＋B：補助対象経費計","A：要望額計","B：要望額計","A＋B：要望額計","A：内示額計","B：内示額計","A＋B：内示額計","様式１\nA：交付申請額計","様式１\nB：交付申請額計","様式１\nA+B：交付申請額計","様式２\nA：交付決定額計","様式２\nB：交付決定額計","様式２\nA+B：交付決定額計","様式３\nA：交付決定変更申請額計\n","様式３\nB：交付決定変更申請額計\n","様式３\nA+B：交付決定変更申請額計\n","様式４\nA：交付決定変更額計\n","様式４\nB：交付決定変更額計\n","様式４\nA+B：交付決定変更額計\n","様式６\nA：進捗状況額計\n","様式６\nB：進捗状況額計\n","様式６\nA+B：進捗状況額\n","様式７\nA：完了実績額計\n","様式７\nB：完了実績額計\n","様式７\nA+B：完了実績額計\n","運転者数","車両数","セイフティバス","要望台数","補助対象経費","要望額","内示額","交付申請額","交付決定額","交付決定変更申請額","交付決定変更額","進捗状況額","完了実績額","要望台数","補助対象経費","要望額","内示額","交付申請額","交付決定額","交付決定変更申請額","交付決定変更額","進捗状況額","完了実績額","要望台数","補助対象経費","要望額","内示額","交付申請額","交付決定額","交付決定変更申請額","交付決定変更額","進捗状況額","完了実績額","要望台数","補助対象経費","要望額","内示額","交付申請額","交付決定額","交付決定変更申請額","交付決定変更額","進捗状況額","完了実績額","要望台数","補助対象経費","要望額","内示額","交付申請額","交付決定額","交付決定変更申請額","交付決定変更額","進捗状況額","完了実績額","要望台数","補助対象経費","要望額","内示額","交付申請額","交付決定額","交付決定変更申請額","交付決定変更額","進捗状況額","完了実績額","要望台数","補助対象経費","要望額","内示額","交付申請額","交付決定額","交付決定変更申請額","交付決定変更額","進捗状況額","完了実績額","要望台数","補助対象経費","要望額","内示額","交付申請額","交付決定額","交付決定変更申請額","交付決定変更額","進捗状況額","完了実績額","要望台数","補助対象経費","要望額","内示額","交付申請額","交付決定額","交付決定変更申請額","交付決定変更額","進捗状況額","完了実績額","要望台数","補助対象経費","要望額","内示額","交付申請額","交付決定額","交付決定変更申請額","交付決定変更額","進捗状況額","完了実績額","要望台数","補助対象経費","要望額","内示額","交付申請額","交付決定額","交付決定変更申請額","交付決定変更額","進捗状況額","完了実績額","要望台数","補助対象経費","要望額","内示額","交付申請額","交付決定額","交付決定変更申請額","交付決定変更額","進捗状況額","完了実績額","要望台数","補助対象経費","要望額","内示額","交付申請額","交付決定額","交付決定変更申請額","交付決定変更額","進捗状況額","完了実績額","要望台数","補助対象経費","要望額","内示額","交付申請額","交付決定額","交付決定変更申請額","交付決定変更額","進捗状況額","完了実績額","要望台数","補助対象経費","要望額","内示額","交付申請額","交付決定額","交付決定変更申請額","交付決定変更額","進捗状況額","完了実績額","要望台数","補助対象経費","要望額","内示額","交付申請額","交付決定額","交付決定変更申請額","交付決定変更額","進捗状況額","完了実績額","要望台数","補助対象経費","要望額","内示額","交付申請額","交付決定額","交付決定変更申請額","交付決定変更額","進捗状況額","完了実績額","要望台数","補助対象経費","要望額","内示額","交付申請額","交付決定額","交付決定変更申請額","交付決定変更額","進捗状況額","完了実績額","要望台数","補助対象経費","要望額","内示額","交付申請額","交付決定額","交付決定変更申請額","交付決定変更額","進捗状況額","完了実績額","要望台数","補助対象経費","要望額","内示額","交付申請額","交付決定額","交付決定変更申請額","交付決定変更額","進捗状況額","完了実績額","要望台数","補助対象経費","要望額","内示額","交付申請額","交付決定額","交付決定変更申請額","交付決定変更額","進捗状況額","完了実績額","要望台数","補助対象経費","要望額","内示額","交付申請額","交付決定額","交付決定変更申請額","交付決定変更額","進捗状況額","完了実績額","要望台数","補助対象経費","要望額","内示額","交付申請額","交付決定額","交付決定変更申請額","交付決定変更額","進捗状況額","完了実績額","要望台数","補助対象経費","要望額","内示額","交付申請額","交付決定額","交付決定変更申請額","交付決定変更額","進捗状況額","完了実績額","要望台数","補助対象経費","要望額","内示額","交付申請額","交付決定額","交付決定変更申請額","交付決定変更額","進捗状況額","完了実績額","事業概要","要望台数","補助対象経費","要望額","内示額","交付申請額","交付決定額","交付決定変更申請額","交付決定変更額","進捗状況額","完了実績額","事業概要","要望台数","補助対象経費","要望額","内示額","交付申請額","交付決定額","交付決定変更申請額","交付決定変更額","進捗状況額","完了実績額","要望台数","補助対象経費","要望額","内示額","交付申請額","交付決定額","交付決定変更申請額","交付決定変更額","進捗状況額","完了実績額","要望台数","補助対象経費","要望額","内示額","交付申請額","交付決定額","交付決定変更申請額","交付決定変更額","進捗状況額","完了実績額","要望台数","補助対象経費","要望額","内示額","交付申請額","交付決定額","交付決定変更申請額","交付決定変更額","進捗状況額","完了実績額","要望台数","補助対象経費","要望額","内示額","交付申請額","交付決定額","交付決定変更申請額","交付決定変更額","進捗状況額","完了実績額","要望台数","補助対象経費","要望額","内示額","交付申請額","交付決定額","交付決定変更申請額","交付決定変更額","進捗状況額","完了実績額","事業概要","要望台数","補助対象経費","要望額","内示額","交付申請額","交付決定額","交付決定変更申請額","交付決定変更額","進捗状況額","完了実績額","要望台数","補助対象経費","要望額","内示額","交付申請額","交付決定額","交付決定変更申請額","交付決定変更額","進捗状況額","完了実績額","要望台数","補助対象経費","要望額","内示額","交付申請額","交付決定額","交付決定変更申請額","交付決定変更額","進捗状況額","完了実績額","要望台数","補助対象経費","要望額","内示額","交付申請額","交付決定額","交付決定変更申請額","交付決定変更額","進捗状況額","完了実績額","１人あたり平均経費","要望人数","補助対象経費","要望額","内示額","交付申請額","交付決定額","交付決定変更申請額","交付決定変更額","進捗状況額","完了実績額","１人あたり平均経費","要望人数","補助対象経費","要望額","内示額","交付申請額","交付決定額","交付決定変更申請額","交付決定変更額","進捗状況額","完了実績額","補助対象経費","要望額","内示額","交付申請額","交付決定額","交付決定変更申請額","交付決定変更額","進捗状況額","完了実績額","事業の具体的内容","補助対象経費","要望額","内示額","交付申請額","交付決定額","交付決定変更申請額","交付決定変更額","進捗状況額","完了実績額","事業の具体的内容","１人あたり平均経費","要望人数","補助対象経費","要望額","内示額","交付申請額","交付決定額","交付決定変更申請額","交付決定変更額","進捗状況額","完了実績額","１人あたり平均経費","要望人数","補助対象経費","要望額","内示額","交付申請額","交付決定額","交付決定変更申請額","交付決定変更額","進捗状況額","完了実績額","１人あたり平均経費","要望人数","補助対象経費","要望額","内示額","交付申請額","交付決定額","交付決定変更申請額","交付決定変更額","進捗状況額","完了実績額","１人あたり平均経費","要望人数","補助対象経費","要望額","内示額","交付申請額","交付決定額","交付決定変更申請額","交付決定変更額","進捗状況額","完了実績額","要望項目","１人あたり平均経費","要望人数","補助対象経費","要望額","内示額","交付申請額","交付決定額","交付決定変更申請額","交付決定変更額","進捗状況額","完了実績額","事業の具体的内容","要望項目","補助対象経費","要望額","内示額","交付申請額","交付決定額","交付決定変更申請額","交付決定変更額","進捗状況額","完了実績額","事業の具体的内容"]
[0,0,0,0,0,{"$f":"IF(OR(EXACT(集計用!F7,\"事業概要：\"), EXACT(集計用!F7,\"ー\"), EXACT(集計用!F7,0), NOT(ISNUMBER(VALUE(集計用!F7)))), 0, IF(集計用!F7=\"\", 0, F12))","v":0},{"$f":"IF(OR(EXACT(集計用!G7,\"事業概要：\"), EXACT(集計用!G7,\"ー\"), EXACT(集計用!G7,0), NOT(ISNUMBER(VALUE(集計用!G7)))), 0, IF(集計用!G7=\"\", 0, G12))","v":0},{"$f":"IF(OR(EXACT(集計用!H7,\"事業概要：\"), EXACT(集計用!H7,\"ー\"), EXACT(集計用!H7,0), NOT(ISNUMBER(VALUE(集計用!H7)))), 0, IF(集計用!H7=\"\", 0, H12))","v":0},{"$f":"IF(OR(EXACT(集計用!I7,\"事業概要：\"), EXACT(集計用!I7,\"ー\"), EXACT(集計用!I7,0), NOT(ISNUMBER(VALUE(集計用!I7)))), 0, IF(集計用!I7=\"\", 0, I12))","v":0},{"$f":"IF(OR(EXACT(集計用!J7,\"事業概要：\"), EXACT(集計用!J7,\"ー\"), ISNUMBER(VALUE(集計用!J7))), 0, IF(集計用!J7=\"\", 0, J12))","v":0},{"$f":"IF(OR(EXACT(集計用!K7,\"事業概要：\"), EXACT(集計用!K7,\"ー\"), EXACT(集計用!K7,0), NOT(ISNUMBER(VALUE(集計用!K7)))), 0, IF(集計用!K7=\"\", 0, K12))","v":0},{"$f":"IF(OR(EXACT(集計用!L7,\"事業概要：\"), EXACT(集計用!L7,\"ー\"), EXACT(集計用!L7,0), NOT(ISNUMBER(VALUE(集計用!L7)))), 0, IF(集計用!L7=\"\", 0, L12))","v":0},{"$f":"IF(OR(EXACT(集計用!M7,\"事業概要：\"), EXACT(集計用!M7,\"ー\"), ISNUMBER(VALUE(集計用!M7))), 0, IF(集計用!M7=\"\", 0, M12))","v":0},{"$f":"IF(OR(EXACT(集計用!N7,\"事業概要：\"), EXACT(集計用!N7,\"ー\"), EXACT(集計用!N7,0), NOT(ISNUMBER(VALUE(集計用!N7)))), 0, IF(集計用!N7=\"\", 0, N12))","v":0},{"$f":"IF(OR(EXACT(集計用!O7,\"事業概要：\"), EXACT(集計用!O7,\"ー\"), ISNUMBER(VALUE(集計用!O7))), 0, IF(集計用!O7=\"\", 0, O12))","v":0},{"$f":"IF(OR(EXACT(集計用!P7,\"事業概要：\"), EXACT(集計用!P7,\"ー\"), EXACT(集計用!P7,0), NOT(ISNUMBER(VALUE(集計用!P7)))), 0, IF(集計用!P7=\"\", 0,P12))","v":0},{"$f":"IF(OR(EXACT(集計用!Q7,\"事業概要：\"), EXACT(集計用!Q7,\"ー\"), ISNUMBER(VALUE(集計用!Q7))), 0, IF(集計用!Q7=\"\", 0, Q12))","v":0},{"$f":"IF(COUNT(INDEX(FIND(補助!I4:I93,集計用!R7),))=LEN(B7),0,R12)","v":0},{"$f":"IF(OR(EXACT(集計用!S7,\"事業概要：\"), EXACT(集計用!S7,\"ー\"), EXACT(集計用!S7,0), NOT(ISNUMBER(VALUE(集計用!S7)))), 0, IF(集計用!S7=\"\", 0, S12))","v":0},{"$f":"IF(OR(EXACT(集計用!T7,\"事業概要：\"), EXACT(集計用!T7,\"ー\"), ISNUMBER(VALUE(集計用!T7))), 0, IF(集計用!T7=\"\", 0, T12))","v":0},{"$f":"IF(OR(EXACT(集計用!U7,\"事業概要：\"), EXACT(集計用!U7,\"ー\"), ISNUMBER(VALUE(集計用!U7))), 0, IF(集計用!U7=\"\", 0, U12))","v":0},{"$f":"IF(OR(EXACT(集計用!V7,\"事業概要：\"), EXACT(集計用!V7,\"ー\"), ISNUMBER(VALUE(集計用!V7))), 0, IF(集計用!V7=\"\", 0, V12))","v":0},{"$f":"IF(OR(EXACT(集計用!W7,\"事業概要：\"), EXACT(集計用!W7,\"ー\"), ISNUMBER(VALUE(集計用!W7))), 0, IF(集計用!W7=\"\", 0, W12))","v":0},{"$f":"IF(OR(EXACT(集計用!X7,\"事業概要：\"), EXACT(集計用!X7,\"ー\"), ISNUMBER(VALUE(集計用!X7))), 0, IF(集計用!X7=\"\", 0, X12))","v":0},{"$f":"IF(OR(EXACT(集計用!Y7,\"事業概要：\"), EXACT(集計用!Y7,\"ー\"), ISNUMBER(VALUE(集計用!Y7))), 0, IF(集計用!Y7=\"\", 0, Y12))","v":0},{"$f":"IF(OR(EXACT(集計用!Z7,\"事業概要：\"), EXACT(集計用!Z7,\"ー\"), ISNUMBER(VALUE(集計用!Z7))), 0, IF(集計用!Z7=\"\", 0, Z12))","v":0},{"$f":"IF(OR(EXACT(集計用!AA7,\"事業概要：\"), EXACT(集計用!AA7,\"ー\"), ISNUMBER(VALUE(集計用!AA7))), 0, IF(集計用!AA7=\"\", 0, AA12))","v":0},{"$f":"IF(OR(EXACT(集計用!AB7,\"事業概要：\"), EXACT(集計用!AB7,\"ー\"), ISNUMBER(VALUE(集計用!AB7))), 0, IF(集計用!AB7=\"\", 0, AB12))","v":0},{"$f":"IF(OR(EXACT(集計用!AC7,\"事業概要：\"), EXACT(集計用!AC7,\"ー\"), ISNUMBER(VALUE(集計用!AC7))), 0, IF(集計用!AC7=\"\", 0, AC12))","v":0},{"$f":"IF(OR(EXACT(集計用!AD7,\"事業概要：\"), EXACT(集計用!AD7,\"ー\"), ISNUMBER(VALUE(集計用!AD7))), 0, IF(集計用!AD7=\"\", 0, AD12))","v":0},{"$f":"IF(OR(EXACT(集計用!AE7,\"事業概要：\"), EXACT(集計用!AE7,\"ー\"), ISNUMBER(VALUE(集計用!AE7))), 0, IF(集計用!AE7=\"\", 0, AE12))","v":0},{"$f":"IF(OR(EXACT(集計用!AF7,\"事業概要：\"), EXACT(集計用!AF7,\"ー\"), ISNUMBER(VALUE(集計用!AF7))), 0, IF(集計用!AF7=\"\", 0, AF12))","v":0},{"$f":"IF(OR(EXACT(集計用!AG7,\"事業概要：\"), EXACT(集計用!AG7,\"ー\"), ISNUMBER(VALUE(集計用!AG7))), 0, IF(集計用!AG7=\"\", 0, AG12))","v":0},{"$f":"IF(OR(EXACT(集計用!AH7,\"事業概要：\"), EXACT(集計用!AH7,\"ー\"), ISNUMBER(VALUE(集計用!AH7))), 0, IF(集計用!AH7=\"\", 0, AH12))","v":0},{"$f":"IF(OR(EXACT(集計用!AI7,\"事業概要：\"), EXACT(集計用!AI7,\"ー\"), ISNUMBER(VALUE(集計用!AI7))), 0, IF(集計用!AI7=\"\", 0, AI12))","v":0},{"$f":"IF(OR(EXACT(集計用!AJ7,\"事業概要：\"), EXACT(集計用!AJ7,\"ー\"), ISNUMBER(VALUE(集計用!AJ7))), 0, IF(集計用!AJ7=\"\", 0, AJ12))","v":0},{"$f":"IF(OR(EXACT(集計用!AK7,\"事業概要：\"), EXACT(集計用!AK7,\"ー\"), ISNUMBER(VALUE(集計用!AK7))), 0, IF(集計用!AK7=\"\", 0, AK12))","v":0},{"$f":"IF(OR(EXACT(集計用!AL7,\"事業概要：\"), EXACT(集計用!AL7,\"ー\"), ISNUMBER(VALUE(集計用!AL7))), 0, IF(集計用!AL7=\"\", 0, AL12))","v":0},{"$f":"IF(OR(EXACT(集計用!AM7,\"事業概要：\"), EXACT(集計用!AM7,\"ー\"), ISNUMBER(VALUE(集計用!AM7))), 0, IF(集計用!AM7=\"\", 0, AM12))","v":0},{"$f":"IF(OR(EXACT(集計用!AN7,\"事業概要：\"), EXACT(集計用!AN7,\"ー\"), ISNUMBER(VALUE(集計用!AN7))), 0, IF(集計用!AN7=\"\", 0, AN12))","v":0},{"$f":"IF(OR(EXACT(集計用!AO7,\"事業概要：\"), EXACT(集計用!AO7,\"ー\"), ISNUMBER(VALUE(集計用!AO7))), 0, IF(集計用!AO7=\"\", 0, AO12))","v":0},{"$f":"IF(OR(EXACT(集計用!AP7,\"事業概要：\"), EXACT(集計用!AP7,\"ー\"), ISNUMBER(VALUE(集計用!AP7))), 0, IF(集計用!AP7=\"\", 0, AP12))","v":0},{"$f":"IF(OR(EXACT(集計用!AQ7,\"事業概要：\"), EXACT(集計用!AQ7,\"ー\"), ISNUMBER(VALUE(集計用!AQ7))), 0, IF(集計用!AQ7=\"\", 0, AQ12))","v":0},{"$f":"IF(OR(EXACT(集計用!AR7,\"事業概要：\"), EXACT(集計用!AR7,\"ー\"), ISNUMBER(VALUE(集計用!AR7))), 0, IF(集計用!AR7=\"\", 0, AR12))","v":0},{"$f":"IF(OR(EXACT(集計用!AS7,\"事業概要：\"), EXACT(集計用!AS7,\"ー\"), ISNUMBER(VALUE(集計用!AS7))), 0, IF(集計用!AS7=\"\", 0, AS12))","v":0},{"$f":"IF(OR(EXACT(集計用!AT7,\"事業概要：\"), EXACT(集計用!AT7,\"ー\"), ISNUMBER(VALUE(集計用!AT7))), 0, IF(集計用!AT7=\"\", 0, AT12))","v":0},{"$f":"IF(OR(EXACT(集計用!AU7,\"事業概要：\"), EXACT(集計用!AU7,\"ー\"), ISNUMBER(VALUE(集計用!AU7))), 0, IF(集計用!AU7=\"\", 0, AU12))","v":0},{"$f":"IF(OR(EXACT(集計用!AV7,\"事業概要：\"), EXACT(集計用!AV7,\"ー\"), ISNUMBER(VALUE(集計用!AV7))), 0, IF(集計用!AV7=\"\", 0, AV12))","v":0},{"$f":"IF(OR(EXACT(集計用!AW7,\"事業概要：\"), EXACT(集計用!AW7,\"ー\"), ISNUMBER(VALUE(集計用!AW7))), 0, IF(集計用!AW7=\"\", 0, AW12))","v":0},{"$f":"IF(OR(EXACT(集計用!AX7,\"事業概要：\"), EXACT(集計用!AX7,\"ー\"), ISNUMBER(VALUE(集計用!AX7))), 0, IF(集計用!AX7=\"\", 0, AX12))","v":0},{"$f":"IF(OR(EXACT(集計用!AY7,\"事業概要：\"), EXACT(集計用!AY7,\"ー\"), ISNUMBER(VALUE(集計用!AY7))), 0, IF(集計用!AY7=\"\", 0, 1))","v":0},{"$f":"IF(OR(EXACT(集計用!AZ7,\"事業概要：\"), EXACT(集計用!AZ7,\"ー\"), ISNUMBER(VALUE(集計用!AZ7))), 0, IF(集計用!AZ7=\"\", 0, 1))","v":0},{"$f":"IF(AND(集計用!BA7>=1, 集計用!BA7<=4), 0, BA12)","v":2},{"$f":"IF(OR(EXACT(集計用!BB7,\"事業概要：\"), EXACT(集計用!BB7,\"ー\"), ISNUMBER(VALUE(集計用!BB7))), 0, IF(集計用!BB7=\"\", 0, BB12))","v":0},{"$f":"IF(OR(EXACT(集計用!BC7,\"事業概要：\"), EXACT(集計用!BC7,\"ー\"), ISNUMBER(VALUE(集計用!BC7))), 0, IF(集計用!BC7=\"\", 0, BC12))","v":0},{"$f":"IF(OR(EXACT(集計用!BD7,\"事業概要：\"), EXACT(集計用!BD7,\"ー\"), ISNUMBER(VALUE(集計用!BD7))), 0, IF(集計用!BD7=\"\", 0, BD12))","v":0},{"$f":"IF(OR(EXACT(集計用!BE7,\"事業概要：\"), EXACT(集計用!BE7,\"ー\"), ISNUMBER(VALUE(集計用!BE7))), 0, IF(集計用!BE7=\"\", 0, BE12))","v":0},{"$f":"IF(OR(EXACT(集計用!BF7,\"事業概要：\"), EXACT(集計用!BF7,\"ー\"), ISNUMBER(VALUE(集計用!BF7))), 0, IF(集計用!BF7=\"\", 0, BF12))","v":0},{"$f":"IF(OR(EXACT(集計用!BG7,\"事業概要：\"), EXACT(集計用!BG7,\"ー\"), ISNUMBER(VALUE(集計用!BG7))), 0, IF(集計用!BG7=\"\", 0, BG12))","v":0},{"$f":"IF(OR(EXACT(集計用!BH7,\"事業概要：\"), EXACT(集計用!BH7,\"ー\"), ISNUMBER(VALUE(集計用!BH7))), 0, IF(集計用!BH7=\"\", 0, BH12))","v":0},{"$f":"IF(OR(EXACT(集計用!BI7,\"事業概要：\"), EXACT(集計用!BI7,\"ー\"), ISNUMBER(VALUE(集計用!BI7))), 0, IF(集計用!BI7=\"\", 0, BI12))","v":0},{"$f":"IF(OR(EXACT(集計用!BJ7,\"事業概要：\"), EXACT(集計用!BJ7,\"ー\"), ISNUMBER(VALUE(集計用!BJ7))), 0, IF(集計用!BJ7=\"\", 0, BJ12))","v":0},{"$f":"IF(OR(EXACT(集計用!BK7,\"事業概要：\"), EXACT(集計用!BK7,\"ー\"), ISNUMBER(VALUE(集計用!BK7))), 0, IF(集計用!BK7=\"\", 0, BK12))","v":0},{"$f":"IF(OR(EXACT(集計用!BL7,\"事業概要：\"), EXACT(集計用!BL7,\"ー\"), ISNUMBER(VALUE(集計用!BL7))), 0, IF(集計用!BL7=\"\", 0, BL12))","v":0},{"$f":"IF(OR(EXACT(集計用!BM7,\"事業概要：\"), EXACT(集計用!BM7,\"ー\"), ISNUMBER(VALUE(集計用!BM7))), 0, IF(集計用!BM7=\"\", 0, BM12))","v":0},{"$f":"IF(OR(EXACT(集計用!BN7,\"事業概要：\"), EXACT(集計用!BN7,\"ー\"), ISNUMBER(VALUE(集計用!BN7))), 0, IF(集計用!BN7=\"\", 0, BN12))","v":0},{"$f":"IF(OR(EXACT(集計用!BO7,\"事業概要：\"), EXACT(集計用!BO7,\"ー\"), ISNUMBER(VALUE(集計用!BO7))), 0, IF(集計用!BO7=\"\", 0, BO12))","v":0},{"$f":"IF(OR(EXACT(集計用!BP7,\"事業概要：\"), EXACT(集計用!BP7,\"ー\"), ISNUMBER(VALUE(集計用!BP7))), 0, IF(集計用!BP7=\"\", 0, BP12))","v":0},{"$f":"IF(OR(EXACT(集計用!BQ7,\"事業概要：\"), EXACT(集計用!BQ7,\"ー\"), ISNUMBER(VALUE(集計用!BQ7))), 0, IF(集計用!BQ7=\"\", 0, BQ12))","v":0},{"$f":"IF(OR(EXACT(集計用!BR7,\"事業概要：\"), EXACT(集計用!BR7,\"ー\"), ISNUMBER(VALUE(集計用!BR7))), 0, IF(集計用!BR7=\"\", 0, BR12))","v":0},{"$f":"IF(OR(EXACT(集計用!BS7,\"事業概要：\"), EXACT(集計用!BS7,\"ー\"), ISNUMBER(VALUE(集計用!BS7))), 0, IF(集計用!BS7=\"\", 0, BS12))","v":0},{"$f":"IF(OR(EXACT(集計用!BT7,\"事業概要：\"), EXACT(集計用!BT7,\"ー\"), ISNUMBER(VALUE(集計用!BT7))), 0, IF(集計用!BT7=\"\", 0, BT12))","v":0},{"$f":"IF(OR(EXACT(集計用!BU7,\"事業概要：\"), EXACT(集計用!BU7,\"ー\"), ISNUMBER(VALUE(集計用!BU7))), 0, IF(集計用!BU7=\"\", 0, BU12))","v":0},{"$f":"IF(OR(EXACT(集計用!BV7,\"事業概要：\"), EXACT(集計用!BV7,\"ー\"), ISNUMBER(VALUE(集計用!BV7))), 0, IF(集計用!BV7=\"\", 0, BV12))","v":0},{"$f":"IF(OR(EXACT(集計用!BW7,\"事業概要：\"), EXACT(集計用!BW7,\"ー\"), ISNUMBER(VALUE(集計用!BW7))), 0, IF(集計用!BW7=\"\", 0, BW12))","v":0},{"$f":"IF(OR(EXACT(集計用!BX7,\"事業概要：\"), EXACT(集計用!BX7,\"ー\"), ISNUMBER(VALUE(集計用!BX7))), 0, IF(集計用!BX7=\"\", 0, BX12))","v":0},{"$f":"IF(OR(EXACT(集計用!BY7,\"事業概要：\"), EXACT(集計用!BY7,\"ー\"), ISNUMBER(VALUE(集計用!BY7))), 0, IF(集計用!BY7=\"\", 0, BY12))","v":0},{"$f":"IF(OR(EXACT(集計用!BZ7,\"事業概要：\"), EXACT(集計用!BZ7,\"ー\"), ISNUMBER(VALUE(集計用!BZ7))), 0, IF(集計用!BZ7=\"\", 0, BZ12))","v":0},{"$f":"IF(OR(EXACT(集計用!CA7,\"事業概要：\"), EXACT(集計用!CA7,\"ー\"), ISNUMBER(VALUE(集計用!CA7))), 0, IF(集計用!CA7=\"\", 0, CA12))","v":0},{"$f":"IF(OR(EXACT(集計用!CB7,\"事業概要：\"), EXACT(集計用!CB7,\"ー\"), ISNUMBER(VALUE(集計用!CB7))), 0, IF(集計用!CB7=\"\", 0, CB12))","v":0},{"$f":"IF(OR(EXACT(集計用!CC7,\"事業概要：\"), EXACT(集計用!CC7,\"ー\"), ISNUMBER(VALUE(集計用!CC7))), 0, IF(集計用!CC7=\"\", 0, CC12))","v":0},{"$f":"IF(OR(EXACT(集計用!CD7,\"事業概要：\"), EXACT(集計用!CD7,\"ー\"), ISNUMBER(VALUE(集計用!CD7))), 0, IF(集計用!CD7=\"\", 0, CD12))","v":0},{"$f":"IF(OR(EXACT(集計用!CE7,\"事業概要：\"), EXACT(集計用!CE7,\"ー\"), ISNUMBER(VALUE(集計用!CE7))), 0, IF(集計用!CE7=\"\", 0, CE12))","v":0},{"$f":"IF(OR(EXACT(集計用!CF7,\"事業概要：\"), EXACT(集計用!CF7,\"ー\"), ISNUMBER(VALUE(集計用!CF7))), 0, IF(集計用!CF7=\"\", 0, CF12))","v":0},{"$f":"IF(OR(EXACT(集計用!CG7,\"事業概要：\"), EXACT(集計用!CG7,\"ー\"), ISNUMBER(VALUE(集計用!CG7))), 0, IF(集計用!CG7=\"\", 0, CG12))","v":0},{"$f":"IF(OR(EXACT(集計用!CH7,\"事業概要：\"), EXACT(集計用!CH7,\"ー\"), ISNUMBER(VALUE(集計用!CH7))), 0, IF(集計用!CH7=\"\", 0, CH12))","v":0},{"$f":"IF(OR(EXACT(集計用!CI7,\"事業概要：\"), EXACT(集計用!CI7,\"ー\"), ISNUMBER(VALUE(集計用!CI7))), 0, IF(集計用!CI7=\"\", 0, CI12))","v":0},{"$f":"IF(OR(EXACT(集計用!CJ7,\"事業概要：\"), EXACT(集計用!CJ7,\"ー\"), ISNUMBER(VALUE(集計用!CJ7))), 0, IF(集計用!CJ7=\"\", 0, CJ12))","v":0},{"$f":"IF(OR(EXACT(集計用!CK7,\"事業概要：\"), EXACT(集計用!CK7,\"ー\"), ISNUMBER(VALUE(集計用!CK7))), 0, IF(集計用!CK7=\"\", 0, CK12))","v":0},{"$f":"IF(OR(EXACT(集計用!CL7,\"事業概要：\"), EXACT(集計用!CL7,\"ー\"), ISNUMBER(VALUE(集計用!CL7))), 0, IF(集計用!CL7=\"\", 0, CL12))","v":0},{"$f":"IF(OR(EXACT(集計用!CM7,\"事業概要：\"), EXACT(集計用!CM7,\"ー\"), ISNUMBER(VALUE(集計用!CM7))), 0, IF(集計用!CM7=\"\", 0, CM12))","v":0},{"$f":"IF(OR(EXACT(集計用!CN7,\"事業概要：\"), EXACT(集計用!CN7,\"ー\"), ISNUMBER(VALUE(集計用!CN7))), 0, IF(集計用!CN7=\"\", 0, CN12))","v":0},{"$f":"IF(OR(EXACT(集計用!CO7,\"事業概要：\"), EXACT(集計用!CO7,\"ー\"), ISNUMBER(VALUE(集計用!CO7))), 0, IF(集計用!CO7=\"\", 0, CO12))","v":0},{"$f":"IF(OR(EXACT(集計用!CP7,\"事業概要：\"), EXACT(集計用!CP7,\"ー\"), ISNUMBER(VALUE(集計用!CP7))), 0, IF(集計用!CP7=\"\", 0, CP12))","v":0},{"$f":"IF(OR(EXACT(集計用!CQ7,\"事業概要：\"), EXACT(集計用!CQ7,\"ー\"), ISNUMBER(VALUE(集計用!CQ7))), 0, IF(集計用!CQ7=\"\", 0, CQ12))","v":0},{"$f":"IF(OR(EXACT(集計用!CR7,\"事業概要：\"), EXACT(集計用!CR7,\"ー\"), ISNUMBER(VALUE(集計用!CR7))), 0, IF(集計用!CR7=\"\", 0, CR12))","v":0},{"$f":"IF(OR(EXACT(集計用!CS7,\"事業概要：\"), EXACT(集計用!CS7,\"ー\"), ISNUMBER(VALUE(集計用!CS7))), 0, IF(集計用!CS7=\"\", 0, CS12))","v":0},{"$f":"IF(OR(EXACT(集計用!CT7,\"事業概要：\"), EXACT(集計用!CT7,\"ー\"), ISNUMBER(VALUE(集計用!CT7))), 0, IF(集計用!CT7=\"\", 0, CT12))","v":0},{"$f":"IF(OR(EXACT(集計用!CU7,\"事業概要：\"), EXACT(集計用!CU7,\"ー\"), ISNUMBER(VALUE(集計用!CU7))), 0, IF(集計用!CU7=\"\", 0, CU12))","v":0},{"$f":"IF(OR(EXACT(集計用!CV7,\"事業概要：\"), EXACT(集計用!CV7,\"ー\"), ISNUMBER(VALUE(集計用!CV7))), 0, IF(集計用!CV7=\"\", 0, CV12))","v":0},{"$f":"IF(OR(EXACT(集計用!CW7,\"事業概要：\"), EXACT(集計用!CW7,\"ー\"), ISNUMBER(VALUE(集計用!CW7))), 0, IF(集計用!CW7=\"\", 0, CW12))","v":0},{"$f":"IF(OR(EXACT(集計用!CX7,\"事業概要：\"), EXACT(集計用!CX7,\"ー\"), ISNUMBER(VALUE(集計用!CX7))), 0, IF(集計用!CX7=\"\", 0, CX12))","v":0},{"$f":"IF(OR(EXACT(集計用!CY7,\"事業概要：\"), EXACT(集計用!CY7,\"ー\"), ISNUMBER(VALUE(集計用!CY7))), 0, IF(集計用!CY7=\"\", 0, CY12))","v":0},{"$f":"IF(OR(EXACT(集計用!CZ7,\"事業概要：\"), EXACT(集計用!CZ7,\"ー\"), ISNUMBER(VALUE(集計用!CZ7))), 0, IF(集計用!CZ7=\"\", 0, CZ12))","v":0},{"$f":"IF(OR(EXACT(集計用!DA7,\"事業概要：\"), EXACT(集計用!DA7,\"ー\"), ISNUMBER(VALUE(集計用!DA7))), 0, IF(集計用!DA7=\"\", 0, DA12))","v":0},{"$f":"IF(OR(EXACT(集計用!DB7,\"事業概要：\"), EXACT(集計用!DB7,\"ー\"), ISNUMBER(VALUE(集計用!DB7))), 0, IF(集計用!DB7=\"\", 0, DB12))","v":0},{"$f":"IF(OR(EXACT(集計用!DC7,\"事業概要：\"), EXACT(集計用!DC7,\"ー\"), ISNUMBER(VALUE(集計用!DC7))), 0, IF(集計用!DC7=\"\", 0, DC12))","v":0},{"$f":"IF(OR(EXACT(集計用!DD7,\"事業概要：\"), EXACT(集計用!DD7,\"ー\"), ISNUMBER(VALUE(集計用!DD7))), 0, IF(集計用!DD7=\"\", 0, DD12))","v":0},{"$f":"IF(OR(EXACT(集計用!DE7,\"事業概要：\"), EXACT(集計用!DE7,\"ー\"), ISNUMBER(VALUE(集計用!DE7))), 0, IF(集計用!DE7=\"\", 0, DE12))","v":0},{"$f":"IF(OR(EXACT(集計用!DF7,\"事業概要：\"), EXACT(集計用!DF7,\"ー\"), ISNUMBER(VALUE(集計用!DF7))), 0, IF(集計用!DF7=\"\", 0, DF12))","v":0},{"$f":"IF(OR(EXACT(集計用!DG7,\"事業概要：\"), EXACT(集計用!DG7,\"ー\"), ISNUMBER(VALUE(集計用!DG7))), 0, IF(集計用!DG7=\"\", 0, DG12))","v":0},{"$f":"IF(OR(EXACT(集計用!DH7,\"事業概要：\"), EXACT(集計用!DH7,\"ー\"), ISNUMBER(VALUE(集計用!DH7))), 0, IF(集計用!DH7=\"\", 0, DH12))","v":0},{"$f":"IF(OR(EXACT(集計用!DI7,\"事業概要：\"), EXACT(集計用!DI7,\"ー\"), ISNUMBER(VALUE(集計用!DI7))), 0, IF(集計用!DI7=\"\", 0, DI12))","v":0},{"$f":"IF(OR(EXACT(集計用!DJ7,\"事業概要：\"), EXACT(集計用!DJ7,\"ー\"), ISNUMBER(VALUE(集計用!DJ7))), 0, IF(集計用!DJ7=\"\", 0, DJ12))","v":0},{"$f":"IF(OR(EXACT(集計用!DK7,\"事業概要：\"), EXACT(集計用!DK7,\"ー\"), ISNUMBER(VALUE(集計用!DK7))), 0, IF(集計用!DK7=\"\", 0, DK12))","v":0},{"$f":"IF(OR(EXACT(集計用!DL7,\"事業概要：\"), EXACT(集計用!DL7,\"ー\"), ISNUMBER(VALUE(集計用!DL7))), 0, IF(集計用!DL7=\"\", 0, DL12))","v":0},{"$f":"IF(OR(EXACT(集計用!DM7,\"事業概要：\"), EXACT(集計用!DM7,\"ー\"), ISNUMBER(VALUE(集計用!DM7))), 0, IF(集計用!DM7=\"\", 0, DM12))","v":0},{"$f":"IF(OR(EXACT(集計用!DN7,\"事業概要：\"), EXACT(集計用!DN7,\"ー\"), ISNUMBER(VALUE(集計用!DN7))), 0, IF(集計用!DN7=\"\", 0, DN12))","v":0},{"$f":"IF(OR(EXACT(集計用!DO7,\"事業概要：\"), EXACT(集計用!DO7,\"ー\"), ISNUMBER(VALUE(集計用!DO7))), 0, IF(集計用!DO7=\"\", 0, DO12))","v":0},{"$f":"IF(OR(EXACT(集計用!DP7,\"事業概要：\"), EXACT(集計用!DP7,\"ー\"), ISNUMBER(VALUE(集計用!DP7))), 0, IF(集計用!DP7=\"\", 0, DP12))","v":0},{"$f":"IF(OR(EXACT(集計用!DQ7,\"事業概要：\"), EXACT(集計用!DQ7,\"ー\"), ISNUMBER(VALUE(集計用!DQ7))), 0, IF(集計用!DQ7=\"\", 0, DQ12))","v":0},{"$f":"IF(OR(EXACT(集計用!DR7,\"事業概要：\"), EXACT(集計用!DR7,\"ー\"), ISNUMBER(VALUE(集計用!DR7))), 0, IF(集計用!DR7=\"\", 0, DR12))","v":0},{"$f":"IF(OR(EXACT(集計用!DS7,\"事業概要：\"), EXACT(集計用!DS7,\"ー\"), ISNUMBER(VALUE(集計用!DS7))), 0, IF(集計用!DS7=\"\", 0, DS12))","v":0},{"$f":"IF(OR(EXACT(集計用!DT7,\"事業概要：\"), EXACT(集計用!DT7,\"ー\"), ISNUMBER(VALUE(集計用!DT7))), 0, IF(集計用!DT7=\"\", 0, DT12))","v":0},{"$f":"IF(OR(EXACT(集計用!DU7,\"事業概要：\"), EXACT(集計用!DU7,\"ー\"), ISNUMBER(VALUE(集計用!DU7))), 0, IF(集計用!DU7=\"\", 0, DU12))","v":0},{"$f":"IF(OR(EXACT(集計用!DV7,\"事業概要：\"), EXACT(集計用!DV7,\"ー\"), ISNUMBER(VALUE(集計用!DV7))), 0, IF(集計用!DV7=\"\", 0, DV12))","v":0},{"$f":"IF(OR(EXACT(集計用!DW7,\"事業概要：\"), EXACT(集計用!DW7,\"ー\"), ISNUMBER(VALUE(集計用!DW7))), 0, IF(集計用!DW7=\"\", 0, DW12))","v":0},{"$f":"IF(OR(EXACT(集計用!DX7,\"事業概要：\"), EXACT(集計用!DX7,\"ー\"), ISNUMBER(VALUE(集計用!DX7))), 0, IF(集計用!DX7=\"\", 0, DX12))","v":0},{"$f":"IF(OR(EXACT(集計用!DY7,\"事業概要：\"), EXACT(集計用!DY7,\"ー\"), ISNUMBER(VALUE(集計用!DY7))), 0, IF(集計用!DY7=\"\", 0, DY12))","v":0},{"$f":"IF(OR(EXACT(集計用!DZ7,\"事業概要：\"), EXACT(集計用!DZ7,\"ー\"), ISNUMBER(VALUE(集計用!DZ7))), 0, IF(集計用!DZ7=\"\", 0, DZ12))","v":0},{"$f":"IF(OR(EXACT(集計用!EA7,\"事業概要：\"), EXACT(集計用!EA7,\"ー\"), ISNUMBER(VALUE(集計用!EA7))), 0, IF(集計用!EA7=\"\", 0, EA12))","v":0},{"$f":"IF(OR(EXACT(集計用!EB7,\"事業概要：\"), EXACT(集計用!EB7,\"ー\"), ISNUMBER(VALUE(集計用!EB7))), 0, IF(集計用!EB7=\"\", 0, EB12))","v":0},{"$f":"IF(OR(EXACT(集計用!EC7,\"事業概要：\"), EXACT(集計用!EC7,\"ー\"), ISNUMBER(VALUE(集計用!EC7))), 0, IF(集計用!EC7=\"\", 0, EC12))","v":0},{"$f":"IF(OR(EXACT(集計用!ED7,\"事業概要：\"), EXACT(集計用!ED7,\"ー\"), ISNUMBER(VALUE(集計用!ED7))), 0, IF(集計用!ED7=\"\", 0, ED12))","v":0},{"$f":"IF(OR(EXACT(集計用!EE7,\"事業概要：\"), EXACT(集計用!EE7,\"ー\"), ISNUMBER(VALUE(集計用!EE7))), 0, IF(集計用!EE7=\"\", 0, EE12))","v":0},{"$f":"IF(OR(EXACT(集計用!EF7,\"事業概要：\"), EXACT(集計用!EF7,\"ー\"), ISNUMBER(VALUE(集計用!EF7))), 0, IF(集計用!EF7=\"\", 0, EF12))","v":0},{"$f":"IF(OR(EXACT(集計用!EG7,\"事業概要：\"), EXACT(集計用!EG7,\"ー\"), ISNUMBER(VALUE(集計用!EG7))), 0, IF(集計用!EG7=\"\", 0, EG12))","v":0},{"$f":"IF(OR(EXACT(集計用!EH7,\"事業概要：\"), EXACT(集計用!EH7,\"ー\"), ISNUMBER(VALUE(集計用!EH7))), 0, IF(集計用!EH7=\"\", 0, EH12))","v":0},{"$f":"IF(OR(EXACT(集計用!EI7,\"事業概要：\"), EXACT(集計用!EI7,\"ー\"), ISNUMBER(VALUE(集計用!EI7))), 0, IF(集計用!EI7=\"\", 0, EI12))","v":0},{"$f":"IF(OR(EXACT(集計用!EJ7,\"事業概要：\"), EXACT(集計用!EJ7,\"ー\"), ISNUMBER(VALUE(集計用!EJ7))), 0, IF(集計用!EJ7=\"\", 0, EJ12))","v":0},{"$f":"IF(OR(EXACT(集計用!EK7,\"事業概要：\"), EXACT(集計用!EK7,\"ー\"), ISNUMBER(VALUE(集計用!EK7))), 0, IF(集計用!EK7=\"\", 0, EK12))","v":0},{"$f":"IF(OR(EXACT(集計用!EL7,\"事業概要：\"), EXACT(集計用!EL7,\"ー\"), ISNUMBER(VALUE(集計用!EL7))), 0, IF(集計用!EL7=\"\", 0, EL12))","v":0},{"$f":"IF(OR(EXACT(集計用!EM7,\"事業概要：\"), EXACT(集計用!EM7,\"ー\"), ISNUMBER(VALUE(集計用!EM7))), 0, IF(集計用!EM7=\"\", 0, EM12))","v":0},{"$f":"IF(OR(EXACT(集計用!EN7,\"事業概要：\"), EXACT(集計用!EN7,\"ー\"), ISNUMBER(VALUE(集計用!EN7))), 0, IF(集計用!EN7=\"\", 0, EN12))","v":0},{"$f":"IF(OR(EXACT(集計用!EO7,\"事業概要：\"), EXACT(集計用!EO7,\"ー\"), ISNUMBER(VALUE(集計用!EO7))), 0, IF(集計用!EO7=\"\", 0, EO12))","v":0},{"$f":"IF(OR(EXACT(集計用!EP7,\"事業概要：\"), EXACT(集計用!EP7,\"ー\"), ISNUMBER(VALUE(集計用!EP7))), 0, IF(集計用!EP7=\"\", 0, EP12))","v":0},{"$f":"IF(OR(EXACT(集計用!EQ7,\"事業概要：\"), EXACT(集計用!EQ7,\"ー\"), ISNUMBER(VALUE(集計用!EQ7))), 0, IF(集計用!EQ7=\"\", 0, EQ12))","v":0},{"$f":"IF(OR(EXACT(集計用!ER7,\"事業概要：\"), EXACT(集計用!ER7,\"ー\"), ISNUMBER(VALUE(集計用!ER7))), 0, IF(集計用!ER7=\"\", 0, ER12))","v":0},{"$f":"IF(OR(EXACT(集計用!ES7,\"事業概要：\"), EXACT(集計用!ES7,\"ー\"), ISNUMBER(VALUE(集計用!ES7))), 0, IF(集計用!ES7=\"\", 0, ES12))","v":0},{"$f":"IF(OR(EXACT(集計用!ET7,\"事業概要：\"), EXACT(集計用!ET7,\"ー\"), ISNUMBER(VALUE(集計用!ET7))), 0, IF(集計用!ET7=\"\", 0, ET12))","v":0},{"$f":"IF(OR(EXACT(集計用!EU7,\"事業概要：\"), EXACT(集計用!EU7,\"ー\"), ISNUMBER(VALUE(集計用!EU7))), 0, IF(集計用!EU7=\"\", 0, EU12))","v":0},{"$f":"IF(OR(EXACT(集計用!EV7,\"事業概要：\"), EXACT(集計用!EV7,\"ー\"), ISNUMBER(VALUE(集計用!EV7))), 0, IF(集計用!EV7=\"\", 0, EV12))","v":0},{"$f":"IF(OR(EXACT(集計用!EW7,\"事業概要：\"), EXACT(集計用!EW7,\"ー\"), ISNUMBER(VALUE(集計用!EW7))), 0, IF(集計用!EW7=\"\", 0, EW12))","v":0},{"$f":"IF(OR(EXACT(集計用!EX7,\"事業概要：\"), EXACT(集計用!EX7,\"ー\"), ISNUMBER(VALUE(集計用!EX7))), 0, IF(集計用!EX7=\"\", 0, EX12))","v":0},{"$f":"IF(OR(EXACT(集計用!EY7,\"事業概要：\"), EXACT(集計用!EY7,\"ー\"), ISNUMBER(VALUE(集計用!EY7))), 0, IF(集計用!EY7=\"\", 0, EY12))","v":0},{"$f":"IF(OR(EXACT(集計用!EZ7,\"事業概要：\"), EXACT(集計用!EZ7,\"ー\"), ISNUMBER(VALUE(集計用!EZ7))), 0, IF(集計用!EZ7=\"\", 0, EZ12))","v":0},{"$f":"IF(OR(EXACT(集計用!FA7,\"事業概要：\"), EXACT(集計用!FA7,\"ー\"), ISNUMBER(VALUE(集計用!FA7))), 0, IF(集計用!FA7=\"\", 0, FA12))","v":0},{"$f":"IF(OR(EXACT(集計用!FB7,\"事業概要：\"), EXACT(集計用!FB7,\"ー\"), ISNUMBER(VALUE(集計用!FB7))), 0, IF(集計用!FB7=\"\", 0, FB12))","v":0},{"$f":"IF(OR(EXACT(集計用!FC7,\"事業概要：\"), EXACT(集計用!FC7,\"ー\"), ISNUMBER(VALUE(集計用!FC7))), 0, IF(集計用!FC7=\"\", 0, FC12))","v":0},{"$f":"IF(OR(EXACT(集計用!FD7,\"事業概要：\"), EXACT(集計用!FD7,\"ー\"), ISNUMBER(VALUE(集計用!FD7))), 0, IF(集計用!FD7=\"\", 0, FD12))","v":0},{"$f":"IF(OR(EXACT(集計用!FE7,\"事業概要：\"), EXACT(集計用!FE7,\"ー\"), ISNUMBER(VALUE(集計用!FE7))), 0, IF(集計用!FE7=\"\", 0, FE12))","v":0},{"$f":"IF(OR(EXACT(集計用!FF7,\"事業概要：\"), EXACT(集計用!FF7,\"ー\"), ISNUMBER(VALUE(集計用!FF7))), 0, IF(集計用!FF7=\"\", 0, FF12))","v":0},{"$f":"IF(OR(EXACT(集計用!FG7,\"事業概要：\"), EXACT(集計用!FG7,\"ー\"), ISNUMBER(VALUE(集計用!FG7))), 0, IF(集計用!FG7=\"\", 0, FG12))","v":0},{"$f":"IF(OR(EXACT(集計用!FH7,\"事業概要：\"), EXACT(集計用!FH7,\"ー\"), ISNUMBER(VALUE(集計用!FH7))), 0, IF(集計用!FH7=\"\", 0, FH12))","v":0},{"$f":"IF(OR(EXACT(集計用!FI7,\"事業概要：\"), EXACT(集計用!FI7,\"ー\"), ISNUMBER(VALUE(集計用!FI7))), 0, IF(集計用!FI7=\"\", 0, FI12))","v":0},{"$f":"IF(OR(EXACT(集計用!FJ7,\"事業概要：\"), EXACT(集計用!FJ7,\"ー\"), ISNUMBER(VALUE(集計用!FJ7))), 0, IF(集計用!FJ7=\"\", 0, FJ12))","v":0},{"$f":"IF(OR(EXACT(集計用!FK7,\"事業概要：\"), EXACT(集計用!FK7,\"ー\"), ISNUMBER(VALUE(集計用!FK7))), 0, IF(集計用!FK7=\"\", 0, FK12))","v":0},{"$f":"IF(OR(EXACT(集計用!FL7,\"事業概要：\"), EXACT(集計用!FL7,\"ー\"), ISNUMBER(VALUE(集計用!FL7))), 0, IF(集計用!FL7=\"\", 0, FL12))","v":0},{"$f":"IF(OR(EXACT(集計用!FM7,\"事業概要：\"), EXACT(集計用!FM7,\"ー\"), ISNUMBER(VALUE(集計用!FM7))), 0, IF(集計用!FM7=\"\", 0, FM12))","v":0},{"$f":"IF(OR(EXACT(集計用!FN7,\"事業概要：\"), EXACT(集計用!FN7,\"ー\"), ISNUMBER(VALUE(集計用!FN7))), 0, IF(集計用!FN7=\"\", 0, FN12))","v":0},{"$f":"IF(OR(EXACT(集計用!FO7,\"事業概要：\"), EXACT(集計用!FO7,\"ー\"), ISNUMBER(VALUE(集計用!FO7))), 0, IF(集計用!FO7=\"\", 0, FO12))","v":0},{"$f":"IF(OR(EXACT(集計用!FP7,\"事業概要：\"), EXACT(集計用!FP7,\"ー\"), ISNUMBER(VALUE(集計用!FP7))), 0, IF(集計用!FP7=\"\", 0, FP12))","v":0},{"$f":"IF(OR(EXACT(集計用!FQ7,\"事業概要：\"), EXACT(集計用!FQ7,\"ー\"), ISNUMBER(VALUE(集計用!FQ7))), 0, IF(集計用!FQ7=\"\", 0, FQ12))","v":0},{"$f":"IF(OR(EXACT(集計用!FR7,\"事業概要：\"), EXACT(集計用!FR7,\"ー\"), ISNUMBER(VALUE(集計用!FR7))), 0, IF(集計用!FR7=\"\", 0, FR12))","v":0},{"$f":"IF(OR(EXACT(集計用!FS7,\"事業概要：\"), EXACT(集計用!FS7,\"ー\"), ISNUMBER(VALUE(集計用!FS7))), 0, IF(集計用!FS7=\"\", 0, FS12))","v":0},{"$f":"IF(OR(EXACT(集計用!FT7,\"事業概要：\"), EXACT(集計用!FT7,\"ー\"), ISNUMBER(VALUE(集計用!FT7))), 0, IF(集計用!FT7=\"\", 0, FT12))","v":0},{"$f":"IF(OR(EXACT(集計用!FU7,\"事業概要：\"), EXACT(集計用!FU7,\"ー\"), ISNUMBER(VALUE(集計用!FU7))), 0, IF(集計用!FU7=\"\", 0, FU12))","v":0},{"$f":"IF(OR(EXACT(集計用!FV7,\"事業概要：\"), EXACT(集計用!FV7,\"ー\"), ISNUMBER(VALUE(集計用!FV7))), 0, IF(集計用!FV7=\"\", 0, FV12))","v":0},{"$f":"IF(OR(EXACT(集計用!FW7,\"事業概要：\"), EXACT(集計用!FW7,\"ー\"), ISNUMBER(VALUE(集計用!FW7))), 0, IF(集計用!FW7=\"\", 0, FW12))","v":0},{"$f":"IF(OR(EXACT(集計用!FX7,\"事業概要：\"), EXACT(集計用!FX7,\"ー\"), ISNUMBER(VALUE(集計用!FX7))), 0, IF(集計用!FX7=\"\", 0, FX12))","v":0},{"$f":"IF(OR(EXACT(集計用!FY7,\"事業概要：\"), EXACT(集計用!FY7,\"ー\"), ISNUMBER(VALUE(集計用!FY7))), 0, IF(集計用!FY7=\"\", 0, FY12))","v":0},{"$f":"IF(OR(EXACT(集計用!FZ7,\"事業概要：\"), EXACT(集計用!FZ7,\"ー\"), ISNUMBER(VALUE(集計用!FZ7))), 0, IF(集計用!FZ7=\"\", 0, FZ12))","v":0},{"$f":"IF(OR(EXACT(集計用!GA7,\"事業概要：\"), EXACT(集計用!GA7,\"ー\"), ISNUMBER(VALUE(集計用!GA7))), 0, IF(集計用!GA7=\"\", 0, GA12))","v":0},{"$f":"IF(OR(EXACT(集計用!GB7,\"事業概要：\"), EXACT(集計用!GB7,\"ー\"), ISNUMBER(VALUE(集計用!GB7))), 0, IF(集計用!GB7=\"\", 0, GB12))","v":0},{"$f":"IF(OR(EXACT(集計用!GC7,\"事業概要：\"), EXACT(集計用!GC7,\"ー\"), ISNUMBER(VALUE(集計用!GC7))), 0, IF(集計用!GC7=\"\", 0, GC12))","v":0},{"$f":"IF(OR(EXACT(集計用!GD7,\"事業概要：\"), EXACT(集計用!GD7,\"ー\"), ISNUMBER(VALUE(集計用!GD7))), 0, IF(集計用!GD7=\"\", 0, GD12))","v":0},{"$f":"IF(OR(EXACT(集計用!GE7,\"事業概要：\"), EXACT(集計用!GE7,\"ー\"), ISNUMBER(VALUE(集計用!GE7))), 0, IF(集計用!GE7=\"\", 0, GE12))","v":0},{"$f":"IF(OR(EXACT(集計用!GF7,\"事業概要：\"), EXACT(集計用!GF7,\"ー\"), ISNUMBER(VALUE(集計用!GF7))), 0, IF(集計用!GF7=\"\", 0, GF12))","v":0},{"$f":"IF(OR(EXACT(集計用!GG7,\"事業概要：\"), EXACT(集計用!GG7,\"ー\"), ISNUMBER(VALUE(集計用!GG7))), 0, IF(集計用!GG7=\"\", 0, GG12))","v":0},{"$f":"IF(OR(EXACT(集計用!GH7,\"事業概要：\"), EXACT(集計用!GH7,\"ー\"), ISNUMBER(VALUE(集計用!GH7))), 0, IF(集計用!GH7=\"\", 0, GH12))","v":0},{"$f":"IF(OR(EXACT(集計用!GI7,\"事業概要：\"), EXACT(集計用!GI7,\"ー\"), ISNUMBER(VALUE(集計用!GI7))), 0, IF(集計用!GI7=\"\", 0, GI12))","v":0},{"$f":"IF(OR(EXACT(集計用!GJ7,\"事業概要：\"), EXACT(集計用!GJ7,\"ー\"), ISNUMBER(VALUE(集計用!GJ7))), 0, IF(集計用!GJ7=\"\", 0, GJ12))","v":0},{"$f":"IF(OR(EXACT(集計用!GK7,\"事業概要：\"), EXACT(集計用!GK7,\"ー\"), ISNUMBER(VALUE(集計用!GK7))), 0, IF(集計用!GK7=\"\", 0, GK12))","v":0},{"$f":"IF(OR(EXACT(集計用!GL7,\"事業概要：\"), EXACT(集計用!GL7,\"ー\"), ISNUMBER(VALUE(集計用!GL7))), 0, IF(集計用!GL7=\"\", 0, GL12))","v":0},{"$f":"IF(OR(EXACT(集計用!GM7,\"事業概要：\"), EXACT(集計用!GM7,\"ー\"), ISNUMBER(VALUE(集計用!GM7))), 0, IF(集計用!GM7=\"\", 0, GM12))","v":0},{"$f":"IF(OR(EXACT(集計用!GN7,\"事業概要：\"), EXACT(集計用!GN7,\"ー\"), ISNUMBER(VALUE(集計用!GN7))), 0, IF(集計用!GN7=\"\", 0, GN12))","v":0},{"$f":"IF(OR(EXACT(集計用!GO7,\"事業概要：\"), EXACT(集計用!GO7,\"ー\"), ISNUMBER(VALUE(集計用!GO7))), 0, IF(集計用!GO7=\"\", 0, GO12))","v":0},{"$f":"IF(OR(EXACT(集計用!GP7,\"事業概要：\"), EXACT(集計用!GP7,\"ー\"), ISNUMBER(VALUE(集計用!GP7))), 0, IF(集計用!GP7=\"\", 0, GP12))","v":0},{"$f":"IF(OR(EXACT(集計用!GQ7,\"事業概要：\"), EXACT(集計用!GQ7,\"ー\"), ISNUMBER(VALUE(集計用!GQ7))), 0, IF(集計用!GQ7=\"\", 0, GQ12))","v":0},{"$f":"IF(OR(EXACT(集計用!GR7,\"事業概要：\"), EXACT(集計用!GR7,\"ー\"), ISNUMBER(VALUE(集計用!GR7))), 0, IF(集計用!GR7=\"\", 0, GR12))","v":0},{"$f":"IF(OR(EXACT(集計用!GS7,\"事業概要：\"), EXACT(集計用!GS7,\"ー\"), ISNUMBER(VALUE(集計用!GS7))), 0, IF(集計用!GS7=\"\", 0, GS12))","v":0},{"$f":"IF(OR(EXACT(集計用!GT7,\"事業概要：\"), EXACT(集計用!GT7,\"ー\"), ISNUMBER(VALUE(集計用!GT7))), 0, IF(集計用!GT7=\"\", 0, GT12))","v":0},{"$f":"IF(OR(EXACT(集計用!GU7,\"事業概要：\"), EXACT(集計用!GU7,\"ー\"), ISNUMBER(VALUE(集計用!GU7))), 0, IF(集計用!GU7=\"\", 0, GU12))","v":0},{"$f":"IF(OR(EXACT(集計用!GV7,\"事業概要：\"), EXACT(集計用!GV7,\"ー\"), ISNUMBER(VALUE(集計用!GV7))), 0, IF(集計用!GV7=\"\", 0, GV12))","v":0},{"$f":"IF(OR(EXACT(集計用!GW7,\"事業概要：\"), EXACT(集計用!GW7,\"ー\"), ISNUMBER(VALUE(集計用!GW7))), 0, IF(集計用!GW7=\"\", 0, GW12))","v":0},{"$f":"IF(OR(EXACT(集計用!GX7,\"事業概要：\"), EXACT(集計用!GX7,\"ー\"), ISNUMBER(VALUE(集計用!GX7))), 0, IF(集計用!GX7=\"\", 0, GX12))","v":0},{"$f":"IF(OR(EXACT(集計用!GY7,\"事業概要：\"), EXACT(集計用!GY7,\"ー\"), ISNUMBER(VALUE(集計用!GY7))), 0, IF(集計用!GY7=\"\", 0, GY12))","v":0},{"$f":"IF(OR(EXACT(集計用!GZ7,\"事業概要：\"), EXACT(集計用!GZ7,\"ー\"), ISNUMBER(VALUE(集計用!GZ7))), 0, IF(集計用!GZ7=\"\", 0, GZ12))","v":0},{"$f":"IF(OR(EXACT(集計用!HA7,\"事業概要：\"), EXACT(集計用!HA7,\"ー\"), ISNUMBER(VALUE(集計用!HA7))), 0, IF(集計用!HA7=\"\", 0, HA12))","v":0},{"$f":"IF(OR(EXACT(集計用!HB7,\"事業概要：\"), EXACT(集計用!HB7,\"ー\"), ISNUMBER(VALUE(集計用!HB7))), 0, IF(集計用!HB7=\"\", 0, HB12))","v":0},{"$f":"IF(OR(EXACT(集計用!HC7,\"事業概要：\"), EXACT(集計用!HC7,\"ー\"), ISNUMBER(VALUE(集計用!HC7))), 0, IF(集計用!HC7=\"\", 0, HC12))","v":0},{"$f":"IF(OR(EXACT(集計用!HD7,\"事業概要：\"), EXACT(集計用!HD7,\"ー\"), ISNUMBER(VALUE(集計用!HD7))), 0, IF(集計用!HD7=\"\", 0, HD12))","v":0},{"$f":"IF(OR(EXACT(集計用!HE7,\"事業概要：\"), EXACT(集計用!HE7,\"ー\"), ISNUMBER(VALUE(集計用!HE7))), 0, IF(集計用!HE7=\"\", 0, HE12))","v":0},{"$f":"IF(OR(EXACT(集計用!HF7,\"事業概要：\"), EXACT(集計用!HF7,\"ー\"), ISNUMBER(VALUE(集計用!HF7))), 0, IF(集計用!HF7=\"\", 0, HF12))","v":0},{"$f":"IF(OR(EXACT(集計用!HG7,\"事業概要：\"), EXACT(集計用!HG7,\"ー\"), ISNUMBER(VALUE(集計用!HG7))), 0, IF(集計用!HG7=\"\", 0, HG12))","v":0},{"$f":"IF(OR(EXACT(集計用!HH7,\"事業概要：\"), EXACT(集計用!HH7,\"ー\"), ISNUMBER(VALUE(集計用!HH7))), 0, IF(集計用!HH7=\"\", 0, HH12))","v":0},{"$f":"IF(OR(EXACT(集計用!HI7,\"事業概要：\"), EXACT(集計用!HI7,\"ー\"), ISNUMBER(VALUE(集計用!HI7))), 0, IF(集計用!HI7=\"\", 0, HI12))","v":0},{"$f":"IF(OR(EXACT(集計用!HJ7,\"事業概要：\"), EXACT(集計用!HJ7,\"ー\"), ISNUMBER(VALUE(集計用!HJ7))), 0, IF(集計用!HJ7=\"\", 0, HJ12))","v":0},{"$f":"IF(OR(EXACT(集計用!HK7,\"事業概要：\"), EXACT(集計用!HK7,\"ー\"), ISNUMBER(VALUE(集計用!HK7))), 0, IF(集計用!HK7=\"\", 0, HK12))","v":0},{"$f":"IF(OR(EXACT(集計用!HL7,\"事業概要：\"), EXACT(集計用!HL7,\"ー\"), ISNUMBER(VALUE(集計用!HL7))), 0, IF(集計用!HL7=\"\", 0, HL12))","v":0},{"$f":"IF(OR(EXACT(集計用!HM7,\"事業概要：\"), EXACT(集計用!HM7,\"ー\"), ISNUMBER(VALUE(集計用!HM7))), 0, IF(集計用!HM7=\"\", 0, HM12))","v":0},{"$f":"IF(OR(EXACT(集計用!HN7,\"事業概要：\"), EXACT(集計用!HN7,\"ー\"), ISNUMBER(VALUE(集計用!HN7))), 0, IF(集計用!HN7=\"\", 0, HN12))","v":0},{"$f":"IF(OR(EXACT(集計用!HO7,\"事業概要：\"), EXACT(集計用!HO7,\"ー\"), ISNUMBER(VALUE(集計用!HO7))), 0, IF(集計用!HO7=\"\", 0, HO12))","v":0},{"$f":"IF(OR(EXACT(集計用!HP7,\"事業概要：\"), EXACT(集計用!HP7,\"ー\"), ISNUMBER(VALUE(集計用!HP7))), 0, IF(集計用!HP7=\"\", 0, HP12))","v":0},{"$f":"IF(OR(EXACT(集計用!HQ7,\"事業概要：\"), EXACT(集計用!HQ7,\"ー\"), ISNUMBER(VALUE(集計用!HQ7))), 0, IF(集計用!HQ7=\"\", 0, HQ12))","v":0},{"$f":"IF(OR(EXACT(集計用!HR7,\"事業概要：\"), EXACT(集計用!HR7,\"ー\"), ISNUMBER(VALUE(集計用!HR7))), 0, IF(集計用!HR7=\"\", 0, HR12))","v":0},{"$f":"IF(OR(EXACT(集計用!HS7,\"事業概要：\"), EXACT(集計用!HS7,\"ー\"), ISNUMBER(VALUE(集計用!HS7))), 0, IF(集計用!HS7=\"\", 0, HS12))","v":0},{"$f":"IF(OR(EXACT(集計用!HT7,\"事業概要：\"), EXACT(集計用!HT7,\"ー\"), ISNUMBER(VALUE(集計用!HT7))), 0, IF(集計用!HT7=\"\", 0, HT12))","v":0},{"$f":"IF(OR(EXACT(集計用!HU7,\"事業概要：\"), EXACT(集計用!HU7,\"ー\"), ISNUMBER(VALUE(集計用!HU7))), 0, IF(集計用!HU7=\"\", 0, HU12))","v":0},{"$f":"IF(OR(EXACT(集計用!HV7,\"事業概要：\"), EXACT(集計用!HV7,\"ー\"), ISNUMBER(VALUE(集計用!HV7))), 0, IF(集計用!HV7=\"\", 0, HV12))","v":0},{"$f":"IF(OR(EXACT(集計用!HW7,\"事業概要：\"), EXACT(集計用!HW7,\"ー\"), ISNUMBER(VALUE(集計用!HW7))), 0, IF(集計用!HW7=\"\", 0, HW12))","v":0},{"$f":"IF(OR(EXACT(集計用!HX7,\"事業概要：\"), EXACT(集計用!HX7,\"ー\"), ISNUMBER(VALUE(集計用!HX7))), 0, IF(集計用!HX7=\"\", 0, HX12))","v":0},{"$f":"IF(OR(EXACT(集計用!HY7,\"事業概要：\"), EXACT(集計用!HY7,\"ー\"), ISNUMBER(VALUE(集計用!HY7))), 0, IF(集計用!HY7=\"\", 0, HY12))","v":0},{"$f":"IF(OR(EXACT(集計用!HZ7,\"事業概要：\"), EXACT(集計用!HZ7,\"ー\"), ISNUMBER(VALUE(集計用!HZ7))), 0, IF(集計用!HZ7=\"\", 0, HZ12))","v":0},{"$f":"IF(OR(EXACT(集計用!IA7,\"事業概要：\"), EXACT(集計用!IA7,\"ー\"), ISNUMBER(VALUE(集計用!IA7))), 0, IF(集計用!IA7=\"\", 0, IA12))","v":0},{"$f":"IF(OR(EXACT(集計用!IB7,\"事業概要：\"), EXACT(集計用!IB7,\"ー\"), ISNUMBER(VALUE(集計用!IB7))), 0, IF(集計用!IB7=\"\", 0, IB12))","v":0},{"$f":"IF(OR(EXACT(集計用!IC7,\"事業概要：\"), EXACT(集計用!IC7,\"ー\"), ISNUMBER(VALUE(集計用!IC7))), 0, IF(集計用!IC7=\"\", 0, IC12))","v":0},{"$f":"IF(OR(EXACT(集計用!ID7,\"事業概要：\"), EXACT(集計用!ID7,\"ー\"), ISNUMBER(VALUE(集計用!ID7))), 0, IF(集計用!ID7=\"\", 0, ID12))","v":0},{"$f":"IF(OR(EXACT(集計用!IE7,\"事業概要：\"), EXACT(集計用!IE7,\"ー\"), ISNUMBER(VALUE(集計用!IE7))), 0, IF(集計用!IE7=\"\", 0, IE12))","v":0},{"$f":"IF(OR(EXACT(集計用!IF7,\"事業概要：\"), EXACT(集計用!IF7,\"ー\"), ISNUMBER(VALUE(集計用!IF7))), 0, IF(集計用!IF7=\"\", 0, IF12))","v":0},{"$f":"IF(OR(EXACT(集計用!IG7,\"事業概要：\"), EXACT(集計用!IG7,\"ー\"), ISNUMBER(VALUE(集計用!IG7))), 0, IF(集計用!IG7=\"\", 0, IG12))","v":0},{"$f":"IF(OR(EXACT(集計用!IH7,\"事業概要：\"), EXACT(集計用!IH7,\"ー\"), ISNUMBER(VALUE(集計用!IH7))), 0, IF(集計用!IH7=\"\", 0, IH12))","v":0},{"$f":"IF(OR(EXACT(集計用!II7,\"事業概要：\"), EXACT(集計用!II7,\"ー\"), ISNUMBER(VALUE(集計用!II7))), 0, IF(集計用!II7=\"\", 0, II12))","v":0},{"$f":"IF(OR(EXACT(集計用!IJ7,\"事業概要：\"), EXACT(集計用!IJ7,\"ー\"), ISNUMBER(VALUE(集計用!IJ7))), 0, IF(集計用!IJ7=\"\", 0, IJ12))","v":0},{"$f":"IF(OR(EXACT(集計用!IK7,\"事業概要：\"), EXACT(集計用!IK7,\"ー\"), ISNUMBER(VALUE(集計用!IK7))), 0, IF(集計用!IK7=\"\", 0, IK12))","v":0},{"$f":"IF(OR(EXACT(集計用!IL7,\"事業概要：\"), EXACT(集計用!IL7,\"ー\"), ISNUMBER(VALUE(集計用!IL7))), 0, IF(集計用!IL7=\"\", 0, IL12))","v":0},{"$f":"IF(OR(EXACT(集計用!IM7,\"事業概要：\"), EXACT(集計用!IM7,\"ー\"), ISNUMBER(VALUE(集計用!IM7))), 0, IF(集計用!IM7=\"\", 0, IM12))","v":0},{"$f":"IF(OR(EXACT(集計用!IN7,\"事業概要：\"), EXACT(集計用!IN7,\"ー\"), ISNUMBER(VALUE(集計用!IN7))), 0, IF(集計用!IN7=\"\", 0, IN12))","v":0},{"$f":"IF(OR(EXACT(集計用!IO7,\"事業概要：\"), EXACT(集計用!IO7,\"ー\"), ISNUMBER(VALUE(集計用!IO7))), 0, IF(集計用!IO7=\"\", 0, IO12))","v":0},{"$f":"IF(OR(EXACT(集計用!IP7,\"事業概要：\"), EXACT(集計用!IP7,\"ー\"), ISNUMBER(VALUE(集計用!IP7))), 0, IF(集計用!IP7=\"\", 0, IP12))","v":0},{"$f":"IF(OR(EXACT(集計用!IQ7,\"事業概要：\"), EXACT(集計用!IQ7,\"ー\"), ISNUMBER(VALUE(集計用!IQ7))), 0, IF(集計用!IQ7=\"\", 0, IQ12))","v":0},{"$f":"IF(OR(EXACT(集計用!IR7,\"事業概要：\"), EXACT(集計用!IR7,\"ー\"), ISNUMBER(VALUE(集計用!IR7))), 0, IF(集計用!IR7=\"\", 0, IR12))","v":0},{"$f":"IF(OR(EXACT(集計用!IS7,\"事業概要：\"), EXACT(集計用!IS7,\"ー\"), ISNUMBER(VALUE(集計用!IS7))), 0, IF(集計用!IS7=\"\", 0, IS12))","v":0},{"$f":"IF(OR(EXACT(集計用!IT7,\"事業概要：\"), EXACT(集計用!IT7,\"ー\"), ISNUMBER(VALUE(集計用!IT7))), 0, IF(集計用!IT7=\"\", 0, IT12))","v":0},{"$f":"IF(OR(EXACT(集計用!IU7,\"事業概要：\"), EXACT(集計用!IU7,\"ー\"), ISNUMBER(VALUE(集計用!IU7))), 0, IF(集計用!IU7=\"\", 0, IU12))","v":0},{"$f":"IF(OR(EXACT(集計用!IV7,\"事業概要：\"), EXACT(集計用!IV7,\"ー\"), ISNUMBER(VALUE(集計用!IV7))), 0, IF(集計用!IV7=\"\", 0, IV12))","v":0},{"$f":"IF(OR(EXACT(集計用!IW7,\"事業概要：\"), EXACT(集計用!IW7,\"ー\"), ISNUMBER(VALUE(集計用!IW7))), 0, IF(集計用!IW7=\"\", 0, IW12))","v":0},{"$f":"IF(OR(EXACT(集計用!IX7,\"事業概要：\"), EXACT(集計用!IX7,\"ー\"), ISNUMBER(VALUE(集計用!IX7))), 0, IF(集計用!IX7=\"\", 0, IX12))","v":0},{"$f":"IF(OR(EXACT(集計用!IY7,\"事業概要：\"), EXACT(集計用!IY7,\"ー\"), ISNUMBER(VALUE(集計用!IY7))), 0, IF(集計用!IY7=\"\", 0, IY12))","v":0},{"$f":"IF(OR(EXACT(集計用!IZ7,\"事業概要：\"), EXACT(集計用!IZ7,\"ー\"), ISNUMBER(VALUE(集計用!IZ7))), 0, IF(集計用!IZ7=\"\", 0, IZ12))","v":0},{"$f":"IF(OR(EXACT(集計用!JA7,\"事業概要：\"), EXACT(集計用!JA7,\"ー\"), ISNUMBER(VALUE(集計用!JA7))), 0, IF(集計用!JA7=\"\", 0, JA12))","v":0},{"$f":"IF(OR(EXACT(集計用!JB7,\"事業概要：\"), EXACT(集計用!JB7,\"ー\"), ISNUMBER(VALUE(集計用!JB7))), 0, IF(集計用!JB7=\"\", 0, JB12))","v":0},{"$f":"IF(OR(EXACT(集計用!JC7,\"事業概要：\"), EXACT(集計用!JC7,\"ー\"), ISNUMBER(VALUE(集計用!JC7))), 0, IF(集計用!JC7=\"\", 0, JC12))","v":0},{"$f":"IF(OR(EXACT(集計用!JD7,\"事業概要：\"), EXACT(集計用!JD7,\"ー\"), ISNUMBER(VALUE(集計用!JD7))), 0, IF(集計用!JD7=\"\", 0, JD12))","v":0},{"$f":"IF(OR(EXACT(集計用!JE7,\"事業概要：\"), EXACT(集計用!JE7,\"ー\"), ISNUMBER(VALUE(集計用!JE7))), 0, IF(集計用!JE7=\"\", 0, JE12))","v":0},{"$f":"IF(OR(EXACT(集計用!JF7,\"事業概要：\"), EXACT(集計用!JF7,\"ー\"), ISNUMBER(VALUE(集計用!JF7))), 0, IF(集計用!JF7=\"\", 0, JF12))","v":0},{"$f":"IF(OR(EXACT(集計用!JG7,\"事業概要：\"), EXACT(集計用!JG7,\"ー\"), ISNUMBER(VALUE(集計用!JG7))), 0, IF(集計用!JG7=\"\", 0, JG12))","v":0},{"$f":"IF(OR(EXACT(集計用!JH7,\"事業概要：\"), EXACT(集計用!JH7,\"ー\"), ISNUMBER(VALUE(集計用!JH7))), 0, IF(集計用!JH7=\"\", 0, JH12))","v":0},{"$f":"IF(OR(EXACT(集計用!JI7,\"事業概要：\"), EXACT(集計用!JI7,\"ー\"), ISNUMBER(VALUE(集計用!JI7))), 0, IF(集計用!JI7=\"\", 0, JI12))","v":0},{"$f":"IF(OR(EXACT(集計用!JJ7,\"事業概要：\"), EXACT(集計用!JJ7,\"ー\"), ISNUMBER(VALUE(集計用!JJ7))), 0, IF(集計用!JJ7=\"\", 0, JJ12))","v":0},{"$f":"IF(OR(EXACT(集計用!JK7,\"事業概要：\"), EXACT(集計用!JK7,\"ー\"), ISNUMBER(VALUE(集計用!JK7))), 0, IF(集計用!JK7=\"\", 0, JK12))","v":0},{"$f":"IF(OR(EXACT(集計用!JL7,\"事業概要：\"), EXACT(集計用!JL7,\"ー\"), ISNUMBER(VALUE(集計用!JL7))), 0, IF(集計用!JL7=\"\", 0, JL12))","v":0},{"$f":"IF(OR(EXACT(集計用!JM7,\"事業概要：\"), EXACT(集計用!JM7,\"ー\"), ISNUMBER(VALUE(集計用!JM7))), 0, IF(集計用!JM7=\"\", 0, JM12))","v":0},{"$f":"IF(OR(EXACT(集計用!JN7,\"事業概要：\"), EXACT(集計用!JN7,\"ー\"), ISNUMBER(VALUE(集計用!JN7))), 0, IF(集計用!JN7=\"\", 0, JN12))","v":0},{"$f":"IF(OR(EXACT(集計用!JO7,\"事業概要：\"), EXACT(集計用!JO7,\"ー\"), ISNUMBER(VALUE(集計用!JO7))), 0, IF(集計用!JO7=\"\", 0, JO12))","v":0},{"$f":"IF(OR(EXACT(集計用!JP7,\"事業概要：\"), EXACT(集計用!JP7,\"ー\"), ISNUMBER(VALUE(集計用!JP7))), 0, IF(集計用!JP7=\"\", 0, JP12))","v":0},{"$f":"IF(OR(EXACT(集計用!JQ7,\"事業概要：\"), EXACT(集計用!JQ7,\"ー\"), ISNUMBER(VALUE(集計用!JQ7))), 0, IF(集計用!JQ7=\"\", 0, JQ12))","v":0},{"$f":"IF(OR(EXACT(集計用!JR7,\"事業概要：\"), EXACT(集計用!JR7,\"ー\"), ISNUMBER(VALUE(集計用!JR7))), 0, IF(集計用!JR7=\"\", 0, JR12))","v":0},{"$f":"IF(OR(EXACT(集計用!JS7,\"事業概要：\"), EXACT(集計用!JS7,\"ー\"), ISNUMBER(VALUE(集計用!JS7))), 0, IF(集計用!JS7=\"\", 0, JS12))","v":0},{"$f":"IF(OR(EXACT(集計用!JT7,\"事業概要：\"), EXACT(集計用!JT7,\"ー\"), ISNUMBER(VALUE(集計用!JT7))), 0, IF(集計用!JT7=\"\", 0, JT12))","v":0},{"$f":"IF(OR(EXACT(集計用!JU7,\"事業概要：\"), EXACT(集計用!JU7,\"ー\"), ISNUMBER(VALUE(集計用!JU7))), 0, IF(集計用!JU7=\"\", 0, JU12))","v":0},{"$f":"IF(OR(EXACT(集計用!JV7,\"事業概要：\"), EXACT(集計用!JV7,\"ー\"), ISNUMBER(VALUE(集計用!JV7))), 0, IF(集計用!JV7=\"\", 0, JV12))","v":0},{"$f":"IF(OR(EXACT(集計用!JW7,\"事業概要：\"), EXACT(集計用!JW7,\"ー\"), ISNUMBER(VALUE(集計用!JW7))), 0, IF(集計用!JW7=\"\", 0, JW12))","v":0},{"$f":"IF(OR(EXACT(集計用!JX7,\"事業概要：\"), EXACT(集計用!JX7,\"ー\"), ISNUMBER(VALUE(集計用!JX7))), 0, IF(集計用!JX7=\"\", 0, JX12))","v":0},{"$f":"IF(OR(EXACT(集計用!JY7,\"事業概要：\"), EXACT(集計用!JY7,\"ー\"), ISNUMBER(VALUE(集計用!JY7))), 0, IF(集計用!JY7=\"\", 0, JY12))","v":0},{"$f":"IF(OR(EXACT(集計用!JZ7,\"事業概要：\"), EXACT(集計用!JZ7,\"ー\"), ISNUMBER(VALUE(集計用!JZ7))), 0, IF(集計用!JZ7=\"\", 0, JZ12))","v":0},{"$f":"IF(OR(EXACT(集計用!KA7,\"事業概要：\"), EXACT(集計用!KA7,\"ー\"), ISNUMBER(VALUE(集計用!KA7))), 0, IF(集計用!KA7=\"\", 0, KA12))","v":0},{"$f":"IF(OR(EXACT(集計用!KB7,\"事業概要：\"), EXACT(集計用!KB7,\"ー\"), ISNUMBER(VALUE(集計用!KB7))), 0, IF(集計用!KB7=\"\", 0, KB12))","v":0},{"$f":"IF(OR(EXACT(集計用!KC7,\"事業概要：\"), EXACT(集計用!KC7,\"ー\"), ISNUMBER(VALUE(集計用!KC7))), 0, IF(集計用!KC7=\"\", 0, KC12))","v":0},{"$f":"IF(OR(EXACT(集計用!KD7,\"事業概要：\"), EXACT(集計用!KD7,\"ー\"), ISNUMBER(VALUE(集計用!KD7))), 0, IF(集計用!KD7=\"\", 0, KD12))","v":0},{"$f":"IF(OR(EXACT(集計用!KE7,\"事業概要：\"), EXACT(集計用!KE7,\"ー\"), ISNUMBER(VALUE(集計用!KE7))), 0, IF(集計用!KE7=\"\", 0, KE12))","v":0},{"$f":"IF(OR(EXACT(集計用!KF7,\"事業概要：\"), EXACT(集計用!KF7,\"ー\"), ISNUMBER(VALUE(集計用!KF7))), 0, IF(集計用!KF7=\"\", 0, KF12))","v":0},{"$f":"IF(OR(EXACT(集計用!KG7,\"事業概要：\"), EXACT(集計用!KG7,\"ー\"), ISNUMBER(VALUE(集計用!KG7))), 0, IF(集計用!KG7=\"\", 0, KG12))","v":0},{"$f":"IF(OR(EXACT(集計用!KH7,\"事業概要：\"), EXACT(集計用!KH7,\"ー\"), ISNUMBER(VALUE(集計用!KH7))), 0, IF(集計用!KH7=\"\", 0, KH12))","v":0},{"$f":"IF(OR(EXACT(集計用!KI7,\"事業概要：\"), EXACT(集計用!KI7,\"ー\"), ISNUMBER(VALUE(集計用!KI7))), 0, IF(集計用!KI7=\"\", 0, KI12))","v":0},{"$f":"IF(OR(EXACT(集計用!KJ7,\"事業概要：\"), EXACT(集計用!KJ7,\"ー\"), ISNUMBER(VALUE(集計用!KJ7))), 0, IF(集計用!KJ7=\"\", 0, KJ12))","v":0},{"$f":"IF(OR(EXACT(集計用!KK7,\"事業概要：\"), EXACT(集計用!KK7,\"ー\"), ISNUMBER(VALUE(集計用!KK7))), 0, IF(集計用!KK7=\"\", 0, KK12))","v":0},{"$f":"IF(OR(EXACT(集計用!KL7,\"事業概要：\"), EXACT(集計用!KL7,\"ー\"), ISNUMBER(VALUE(集計用!KL7))), 0, IF(集計用!KL7=\"\", 0, KL12))","v":0},{"$f":"IF(OR(EXACT(集計用!KM7,\"事業概要：\"), EXACT(集計用!KM7,\"ー\"), ISNUMBER(VALUE(集計用!KM7))), 0, IF(集計用!KM7=\"\", 0, KM12))","v":0},{"$f":"IF(OR(EXACT(集計用!KN7,\"事業概要：\"), EXACT(集計用!KN7,\"ー\"), ISNUMBER(VALUE(集計用!KN7))), 0, IF(集計用!KN7=\"\", 0, KN12))","v":0},{"$f":"IF(OR(EXACT(集計用!KO7,\"事業概要：\"), EXACT(集計用!KO7,\"ー\"), ISNUMBER(VALUE(集計用!KO7))), 0, IF(集計用!KO7=\"\", 0, KO12))","v":0},{"$f":"IF(OR(EXACT(集計用!KP7,\"事業概要：\"), EXACT(集計用!KP7,\"ー\"), ISNUMBER(VALUE(集計用!KP7))), 0, IF(集計用!KP7=\"\", 0, KP12))","v":0},{"$f":"IF(OR(EXACT(集計用!KQ7,\"事業概要：\"), EXACT(集計用!KQ7,\"ー\"), ISNUMBER(VALUE(集計用!KQ7))), 0, IF(集計用!KQ7=\"\", 0, KQ12))","v":0},{"$f":"IF(OR(EXACT(集計用!KR7,\"事業概要：\"), EXACT(集計用!KR7,\"ー\"), EXACT(集計用!KR7,0), NOT(ISNUMBER(VALUE(集計用!KR7)))), 0, IF(集計用!KR7=\"\", 0, KR12))","v":0},{"$f":"IF(OR(EXACT(集計用!KS7,\"事業概要：\"), EXACT(集計用!KS7,\"ー\"), ISNUMBER(VALUE(集計用!KS7))), 0, IF(集計用!KS7=\"\", 0, KS12))","v":0},{"$f":"IF(OR(EXACT(集計用!KT7,\"事業概要：\"), EXACT(集計用!KT7,\"ー\"), ISNUMBER(VALUE(集計用!KT7))), 0, IF(集計用!KT7=\"\", 0, KT12))","v":0},{"$f":"IF(OR(EXACT(集計用!KU7,\"事業概要：\"), EXACT(集計用!KU7,\"ー\"), ISNUMBER(VALUE(集計用!KU7))), 0, IF(集計用!KU7=\"\", 0, KU12))","v":0},{"$f":"IF(OR(EXACT(集計用!KV7,\"事業概要：\"), EXACT(集計用!KV7,\"ー\"), ISNUMBER(VALUE(集計用!KV7))), 0, IF(集計用!KV7=\"\", 0, KV12))","v":0},{"$f":"IF(OR(EXACT(集計用!KW7,\"事業概要：\"), EXACT(集計用!KW7,\"ー\"), ISNUMBER(VALUE(集計用!KW7))), 0, IF(集計用!KW7=\"\", 0, KW12))","v":0},{"$f":"IF(OR(EXACT(集計用!KX7,\"事業概要：\"), EXACT(集計用!KX7,\"ー\"), ISNUMBER(VALUE(集計用!KX7))), 0, IF(集計用!KX7=\"\", 0, KX12))","v":0},{"$f":"IF(OR(EXACT(集計用!KY7,\"事業概要：\"), EXACT(集計用!KY7,\"ー\"), ISNUMBER(VALUE(集計用!KY7))), 0, IF(集計用!KY7=\"\", 0, KY12))","v":0},{"$f":"IF(OR(EXACT(集計用!KZ7,\"事業概要：\"), EXACT(集計用!KZ7,\"ー\"), ISNUMBER(VALUE(集計用!KZ7))), 0, IF(集計用!KZ7=\"\", 0, KZ12))","v":0},{"$f":"IF(OR(EXACT(集計用!LA7,\"事業概要：\"), EXACT(集計用!LA7,\"ー\"), ISNUMBER(VALUE(集計用!LA7))), 0, IF(集計用!LA7=\"\", 0, LA12))","v":0},{"$f":"IF(OR(EXACT(集計用!LB7,\"事業概要：\"), EXACT(集計用!LB7,\"ー\"), ISNUMBER(VALUE(集計用!LB7))), 0, IF(集計用!LB7=\"\", 0, LB12))","v":0},{"$f":"IF(OR(EXACT(集計用!LC7,\"事業概要：\"), EXACT(集計用!LC7,\"ー\"), EXACT(集計用!LC7,0), NOT(ISNUMBER(VALUE(集計用!LC7)))), 0, IF(集計用!LC7=\"\", 0, LC12))","v":0},{"$f":"IF(OR(EXACT(集計用!LD7,\"事業概要：\"), EXACT(集計用!LD7,\"ー\"), ISNUMBER(VALUE(集計用!LD7))), 0, IF(集計用!LD7=\"\", 0, LD12))","v":0},{"$f":"IF(OR(EXACT(集計用!LE7,\"事業概要：\"), EXACT(集計用!LE7,\"ー\"), ISNUMBER(VALUE(集計用!LE7))), 0, IF(集計用!LE7=\"\", 0, LE12))","v":0},{"$f":"IF(OR(EXACT(集計用!LF7,\"事業概要：\"), EXACT(集計用!LF7,\"ー\"), ISNUMBER(VALUE(集計用!LF7))), 0, IF(集計用!LF7=\"\", 0, LF12))","v":0},{"$f":"IF(OR(EXACT(集計用!LG7,\"事業概要：\"), EXACT(集計用!LG7,\"ー\"), ISNUMBER(VALUE(集計用!LG7))), 0, IF(集計用!LG7=\"\", 0, LG12))","v":0},{"$f":"IF(OR(EXACT(集計用!LH7,\"事業概要：\"), EXACT(集計用!LH7,\"ー\"), ISNUMBER(VALUE(集計用!LH7))), 0, IF(集計用!LH7=\"\", 0, LH12))","v":0},{"$f":"IF(OR(EXACT(集計用!LI7,\"事業概要：\"), EXACT(集計用!LI7,\"ー\"), ISNUMBER(VALUE(集計用!LI7))), 0, IF(集計用!LI7=\"\", 0, LI12))","v":0},{"$f":"IF(OR(EXACT(集計用!LJ7,\"事業概要：\"), EXACT(集計用!LJ7,\"ー\"), ISNUMBER(VALUE(集計用!LJ7))), 0, IF(集計用!LJ7=\"\", 0, LJ12))","v":0},{"$f":"IF(OR(EXACT(集計用!LK7,\"事業概要：\"), EXACT(集計用!LK7,\"ー\"), ISNUMBER(VALUE(集計用!LK7))), 0, IF(集計用!LK7=\"\", 0, LK12))","v":0},{"$f":"IF(OR(EXACT(集計用!LL7,\"事業概要：\"), EXACT(集計用!LL7,\"ー\"), ISNUMBER(VALUE(集計用!LL7))), 0, IF(集計用!LL7=\"\", 0, LL12))","v":0},{"$f":"IF(OR(EXACT(集計用!LM7,\"事業概要：\"), EXACT(集計用!LM7,\"ー\"), ISNUMBER(VALUE(集計用!LM7))), 0, IF(集計用!LM7=\"\", 0, LM12))","v":0},{"$f":"IF(OR(EXACT(集計用!LN7,\"事業概要：\"), EXACT(集計用!LN7,\"ー\"), ISNUMBER(VALUE(集計用!LN7))), 0, IF(集計用!LN7=\"\", 0, LN12))","v":0},{"$f":"IF(OR(EXACT(集計用!LO7,\"事業概要：\"), EXACT(集計用!LO7,\"ー\"), ISNUMBER(VALUE(集計用!LO7))), 0, IF(集計用!LO7=\"\", 0, LO12))","v":0},{"$f":"IF(OR(EXACT(集計用!LP7,\"事業概要：\"), EXACT(集計用!LP7,\"ー\"), ISNUMBER(VALUE(集計用!LP7))), 0, IF(集計用!LP7=\"\", 0, LP12))","v":0},{"$f":"IF(OR(EXACT(集計用!LQ7,\"事業概要：\"), EXACT(集計用!LQ7,\"ー\"), ISNUMBER(VALUE(集計用!LQ7))), 0, IF(集計用!LQ7=\"\", 0, LQ12))","v":0},{"$f":"IF(OR(EXACT(集計用!LR7,\"事業概要：\"), EXACT(集計用!LR7,\"ー\"), ISNUMBER(VALUE(集計用!LR7))), 0, IF(集計用!LR7=\"\", 0, LR12))","v":0},{"$f":"IF(OR(EXACT(集計用!LS7,\"事業概要：\"), EXACT(集計用!LS7,\"ー\"), ISNUMBER(VALUE(集計用!LS7))), 0, IF(集計用!LS7=\"\", 0, LS12))","v":0},{"$f":"IF(OR(EXACT(集計用!LT7,\"事業概要：\"), EXACT(集計用!LT7,\"ー\"), ISNUMBER(VALUE(集計用!LT7))), 0, IF(集計用!LT7=\"\", 0, LT12))","v":0},{"$f":"IF(OR(EXACT(集計用!LU7,\"事業概要：\"), EXACT(集計用!LU7,\"ー\"), ISNUMBER(VALUE(集計用!LU7))), 0, IF(集計用!LU7=\"\", 0, LU12))","v":0},{"$f":"IF(OR(EXACT(集計用!LV7,\"事業概要：\"), EXACT(集計用!LV7,\"ー\"), ISNUMBER(VALUE(集計用!LV7))), 0, IF(集計用!LV7=\"\", 0, LV12))","v":0},{"$f":"IF(OR(EXACT(集計用!LW7,\"事業概要：\"), EXACT(集計用!LW7,\"ー\"), ISNUMBER(VALUE(集計用!LW7))), 0, IF(集計用!LW7=\"\", 0, LW12))","v":0},{"$f":"IF(OR(EXACT(集計用!LX7,\"事業概要：\"), EXACT(集計用!LX7,\"ー\"), ISNUMBER(VALUE(集計用!LX7))), 0, IF(集計用!LX7=\"\", 0, LX12))","v":0},{"$f":"IF(OR(EXACT(集計用!LY7,\"事業概要：\"), EXACT(集計用!LY7,\"ー\"), ISNUMBER(VALUE(集計用!LY7))), 0, IF(集計用!LY7=\"\", 0, LY12))","v":0},{"$f":"IF(OR(EXACT(集計用!LZ7,\"事業概要：\"), EXACT(集計用!LZ7,\"ー\"), ISNUMBER(VALUE(集計用!LZ7))), 0, IF(集計用!LZ7=\"\", 0, LZ12))","v":0},{"$f":"IF(OR(EXACT(集計用!MA7,\"事業概要：\"), EXACT(集計用!MA7,\"ー\"), ISNUMBER(VALUE(集計用!MA7))), 0, IF(集計用!MA7=\"\", 0, MA12))","v":0},{"$f":"IF(OR(EXACT(集計用!MB7,\"事業概要：\"), EXACT(集計用!MB7,\"ー\"), ISNUMBER(VALUE(集計用!MB7))), 0, IF(集計用!MB7=\"\", 0, MB12))","v":0},{"$f":"IF(OR(EXACT(集計用!MC7,\"事業概要：\"), EXACT(集計用!MC7,\"ー\"), ISNUMBER(VALUE(集計用!MC7))), 0, IF(集計用!MC7=\"\", 0, MC12))","v":0},{"$f":"IF(OR(EXACT(集計用!MD7,\"事業概要：\"), EXACT(集計用!MD7,\"ー\"), ISNUMBER(VALUE(集計用!MD7))), 0, IF(集計用!MD7=\"\", 0, MD12))","v":0},{"$f":"IF(OR(EXACT(集計用!ME7,\"事業概要：\"), EXACT(集計用!ME7,\"ー\"), ISNUMBER(VALUE(集計用!ME7))), 0, IF(集計用!ME7=\"\", 0, ME12))","v":0},{"$f":"IF(OR(EXACT(集計用!MF7,\"事業概要：\"), EXACT(集計用!MF7,\"ー\"), ISNUMBER(VALUE(集計用!MF7))), 0, IF(集計用!MF7=\"\", 0, MF12))","v":0},{"$f":"IF(OR(EXACT(集計用!MG7,\"事業概要：\"), EXACT(集計用!MG7,\"ー\"), ISNUMBER(VALUE(集計用!MG7))), 0, IF(集計用!MG7=\"\", 0, MG12))","v":0},{"$f":"IF(OR(EXACT(集計用!MH7,\"事業概要：\"), EXACT(集計用!MH7,\"ー\"), ISNUMBER(VALUE(集計用!MH7))), 0, IF(集計用!MH7=\"\", 0, MH12))","v":0},{"$f":"IF(OR(EXACT(集計用!MI7,\"事業概要：\"), EXACT(集計用!MI7,\"ー\"), ISNUMBER(VALUE(集計用!MI7))), 0, IF(集計用!MI7=\"\", 0, MI12))","v":0},{"$f":"IF(OR(EXACT(集計用!MJ7,\"事業概要：\"), EXACT(集計用!MJ7,\"ー\"), ISNUMBER(VALUE(集計用!MJ7))), 0, IF(集計用!MJ7=\"\", 0, MJ12))","v":0},{"$f":"IF(OR(EXACT(集計用!MK7,\"事業概要：\"), EXACT(集計用!MK7,\"ー\"), ISNUMBER(VALUE(集計用!MK7))), 0, IF(集計用!MK7=\"\", 0, MK12))","v":0},{"$f":"IF(OR(EXACT(集計用!ML7,\"事業概要：\"), EXACT(集計用!ML7,\"ー\"), ISNUMBER(VALUE(集計用!ML7))), 0, IF(集計用!ML7=\"\", 0, ML12))","v":0},{"$f":"IF(OR(EXACT(集計用!MM7,\"事業概要：\"), EXACT(集計用!MM7,\"ー\"), ISNUMBER(VALUE(集計用!MM7))), 0, IF(集計用!MM7=\"\", 0, MM12))","v":0},{"$f":"IF(OR(EXACT(集計用!MN7,\"事業概要：\"), EXACT(集計用!MN7,\"ー\"), ISNUMBER(VALUE(集計用!MN7))), 0, IF(集計用!MN7=\"\", 0, MN12))","v":0},{"$f":"IF(OR(EXACT(集計用!MO7,\"事業概要：\"), EXACT(集計用!MO7,\"ー\"), ISNUMBER(VALUE(集計用!MO7))), 0, IF(集計用!MO7=\"\", 0, MO12))","v":0},{"$f":"IF(OR(EXACT(集計用!MP7,\"事業概要：\"), EXACT(集計用!MP7,\"ー\"), ISNUMBER(VALUE(集計用!MP7))), 0, IF(集計用!MP7=\"\", 0, MP12))","v":0},{"$f":"IF(OR(EXACT(集計用!MQ7,\"事業概要：\"), EXACT(集計用!MQ7,\"ー\"), ISNUMBER(VALUE(集計用!MQ7))), 0, IF(集計用!MQ7=\"\", 0, MQ12))","v":0},{"$f":"IF(OR(EXACT(集計用!MR7,\"事業概要：\"), EXACT(集計用!MR7,\"ー\"), ISNUMBER(VALUE(集計用!MR7))), 0, IF(集計用!MR7=\"\", 0, MR12))","v":0},{"$f":"IF(OR(EXACT(集計用!MS7,\"事業概要：\"), EXACT(集計用!MS7,\"ー\"), ISNUMBER(VALUE(集計用!MS7))), 0, IF(集計用!MS7=\"\", 0, MS12))","v":0},{"$f":"IF(OR(EXACT(集計用!MT7,\"事業概要：\"), EXACT(集計用!MT7,\"ー\"), ISNUMBER(VALUE(集計用!MT7))), 0, IF(集計用!MT7=\"\", 0, MT12))","v":0},{"$f":"IF(OR(EXACT(集計用!MU7,\"事業概要：\"), EXACT(集計用!MU7,\"ー\"), ISNUMBER(VALUE(集計用!MU7))), 0, IF(集計用!MU7=\"\", 0, MU12))","v":0},{"$f":"IF(OR(EXACT(集計用!MV7,\"事業概要：\"), EXACT(集計用!MV7,\"ー\"), ISNUMBER(VALUE(集計用!MV7))), 0, IF(集計用!MV7=\"\", 0, MV12))","v":0},{"$f":"IF(OR(EXACT(集計用!MW7,\"事業概要：\"), EXACT(集計用!MW7,\"ー\"), ISNUMBER(VALUE(集計用!MW7))), 0, IF(集計用!MW7=\"\", 0, MW12))","v":0},{"$f":"IF(OR(EXACT(集計用!MX7,\"事業概要：\"), EXACT(集計用!MX7,\"ー\"), ISNUMBER(VALUE(集計用!MX7))), 0, IF(集計用!MX7=\"\", 0, MX12))","v":0},{"$f":"IF(OR(EXACT(集計用!MY7,\"事業概要：\"), EXACT(集計用!MY7,\"ー\"), ISNUMBER(VALUE(集計用!MY7))), 0, IF(集計用!MY7=\"\", 0, MY12))","v":0},{"$f":"IF(OR(EXACT(集計用!MZ7,\"事業概要：\"), EXACT(集計用!MZ7,\"ー\"), ISNUMBER(VALUE(集計用!MZ7))), 0, IF(集計用!MZ7=\"\", 0, MZ12))","v":0},{"$f":"IF(OR(EXACT(集計用!NA7,\"事業概要：\"), EXACT(集計用!NA7,\"ー\"), ISNUMBER(VALUE(集計用!NA7))), 0, IF(集計用!NA7=\"\", 0, NA12))","v":0},{"$f":"IF(OR(EXACT(集計用!NB7,\"事業概要：\"), EXACT(集計用!NB7,\"ー\"), ISNUMBER(VALUE(集計用!NB7))), 0, IF(集計用!NB7=\"\", 0, NB12))","v":0},{"$f":"IF(OR(EXACT(集計用!NC7,\"事業概要：\"), EXACT(集計用!NC7,\"ー\"), ISNUMBER(VALUE(集計用!NC7))), 0, IF(集計用!NC7=\"\", 0, NC12))","v":0},{"$f":"IF(OR(EXACT(集計用!ND7,\"事業概要：\"), EXACT(集計用!ND7,\"ー\"), ISNUMBER(VALUE(集計用!ND7))), 0, IF(集計用!ND7=\"\", 0, ND12))","v":0},{"$f":"IF(OR(EXACT(集計用!NE7,\"事業概要：\"), EXACT(集計用!NE7,\"ー\"), ISNUMBER(VALUE(集計用!NE7))), 0, IF(集計用!NE7=\"\", 0, NE12))","v":0},{"$f":"IF(OR(EXACT(集計用!NF7,\"事業概要：\"), EXACT(集計用!NF7,\"ー\"), ISNUMBER(VALUE(集計用!NF7))), 0, IF(集計用!NF7=\"\", 0, NF12))","v":0},{"$f":"IF(OR(EXACT(集計用!NG7,\"事業概要：\"), EXACT(集計用!NG7,\"ー\"), ISNUMBER(VALUE(集計用!NG7))), 0, IF(集計用!NG7=\"\", 0, NG12))","v":0},{"$f":"IF(OR(EXACT(集計用!NH7,\"事業概要：\"), EXACT(集計用!NH7,\"ー\"), ISNUMBER(VALUE(集計用!NH7))), 0, IF(集計用!NH7=\"\", 0, NH12))","v":0},{"$f":"IF(OR(EXACT(集計用!NI7,\"事業概要：\"), EXACT(集計用!NI7,\"ー\"), ISNUMBER(VALUE(集計用!NI7))), 0, IF(集計用!NI7=\"\", 0, NI12))","v":0},{"$f":"IF(OR(EXACT(集計用!NJ7,\"事業概要：\"), EXACT(集計用!NJ7,\"ー\"), ISNUMBER(VALUE(集計用!NJ7))), 0, IF(集計用!NJ7=\"\", 0, NJ12))","v":0},{"$f":"IF(OR(EXACT(集計用!NK7,\"事業概要：\"), EXACT(集計用!NK7,\"ー\"), ISNUMBER(VALUE(集計用!NK7))), 0, IF(集計用!NK7=\"\", 0, NK12))","v":0},{"$f":"IF(OR(EXACT(集計用!NL7,\"事業概要：\"), EXACT(集計用!NL7,\"ー\"), EXACT(集計用!NL7,0), NOT(ISNUMBER(VALUE(集計用!NL7)))), 0, IF(集計用!NL7=\"\", 0, NL12))","v":0},{"$f":"IF(OR(EXACT(集計用!NM7,\"事業概要：\"), EXACT(集計用!NM7,\"ー\"), ISNUMBER(VALUE(集計用!NM7))), 0, IF(集計用!NM7=\"\", 0, NM12))","v":0},{"$f":"IF(OR(EXACT(集計用!NN7,\"事業概要：\"), EXACT(集計用!NN7,\"ー\"), ISNUMBER(VALUE(集計用!NN7))), 0, IF(集計用!NN7=\"\", 0, NN12))","v":0},{"$f":"IF(OR(EXACT(集計用!NO7,\"事業概要：\"), EXACT(集計用!NO7,\"ー\"), ISNUMBER(VALUE(集計用!NO7))), 0, IF(集計用!NO7=\"\", 0, NO12))","v":0},{"$f":"IF(OR(EXACT(集計用!NP7,\"事業概要：\"), EXACT(集計用!NP7,\"ー\"), ISNUMBER(VALUE(集計用!NP7))), 0, IF(集計用!NP7=\"\", 0, NP12))","v":0},{"$f":"IF(OR(EXACT(集計用!NQ7,\"事業概要：\"), EXACT(集計用!NQ7,\"ー\"), ISNUMBER(VALUE(集計用!NQ7))), 0, IF(集計用!NQ7=\"\", 0, NQ12))","v":0},{"$f":"IF(OR(EXACT(集計用!NR7,\"事業概要：\"), EXACT(集計用!NR7,\"ー\"), ISNUMBER(VALUE(集計用!NR7))), 0, IF(集計用!NR7=\"\", 0, NR12))","v":0},{"$f":"IF(OR(EXACT(集計用!NS7,\"事業概要：\"), EXACT(集計用!NS7,\"ー\"), ISNUMBER(VALUE(集計用!NS7))), 0, IF(集計用!NS7=\"\", 0, NS12))","v":0},{"$f":"IF(OR(EXACT(集計用!NT7,\"事業概要：\"), EXACT(集計用!NT7,\"ー\"), ISNUMBER(VALUE(集計用!NT7))), 0, IF(集計用!NT7=\"\", 0, NT12))","v":0},{"$f":"IF(OR(EXACT(集計用!NU7,\"事業概要：\"), EXACT(集計用!NU7,\"ー\"), ISNUMBER(VALUE(集計用!NU7))), 0, IF(集計用!NU7=\"\", 0, NU12))","v":0},{"$f":"IF(OR(EXACT(集計用!NV7,\"事業概要：\"), EXACT(集計用!NV7,\"ー\"), ISNUMBER(VALUE(集計用!NV7))), 0, IF(集計用!NV7=\"\", 0, NV12))","v":0},{"$f":"IF(OR(EXACT(集計用!NW7,\"事業概要：\"), EXACT(集計用!NW7,\"ー\"), ISNUMBER(VALUE(集計用!NW7))), 0, IF(集計用!NW7=\"\", 0, NW12))","v":0},{"$f":"IF(OR(EXACT(集計用!NX7,\"事業概要：\"), EXACT(集計用!NX7,\"ー\"), ISNUMBER(VALUE(集計用!NX7))), 0, IF(集計用!NX7=\"\", 0, NX12))","v":0},{"$f":"IF(OR(EXACT(集計用!NY7,\"事業概要：\"), EXACT(集計用!NY7,\"ー\"), ISNUMBER(VALUE(集計用!NY7))), 0, IF(集計用!NY7=\"\", 0, NY12))","v":0},{"$f":"IF(OR(EXACT(集計用!NZ7,\"事業概要：\"), EXACT(集計用!NZ7,\"ー\"), ISNUMBER(VALUE(集計用!NZ7))), 0, IF(集計用!NZ7=\"\", 0, NZ12))","v":0},{"$f":"IF(OR(EXACT(集計用!OA7,\"事業概要：\"), EXACT(集計用!OA7,\"ー\"), ISNUMBER(VALUE(集計用!OA7))), 0, IF(集計用!OA7=\"\", 0, OA12))","v":0},{"$f":"IF(OR(EXACT(集計用!OB7,\"事業概要：\"), EXACT(集計用!OB7,\"ー\"), ISNUMBER(VALUE(集計用!OB7))), 0, IF(集計用!OB7=\"\", 0, OB12))","v":0},{"$f":"IF(OR(EXACT(集計用!OC7,\"事業概要：\"), EXACT(集計用!OC7,\"ー\"), ISNUMBER(VALUE(集計用!OC7))), 0, IF(集計用!OC7=\"\", 0, OC12))","v":0},{"$f":"IF(OR(EXACT(集計用!OD7,\"事業概要：\"), EXACT(集計用!OD7,\"ー\"), ISNUMBER(VALUE(集計用!OD7))), 0, IF(集計用!OD7=\"\", 0, OD12))","v":0},{"$f":"IF(OR(EXACT(集計用!OE7,\"事業概要：\"), EXACT(集計用!OE7,\"ー\"), ISNUMBER(VALUE(集計用!OE7))), 0, IF(集計用!OE7=\"\", 0, OE12))","v":0},{"$f":"IF(OR(EXACT(集計用!OF7,\"事業概要：\"), EXACT(集計用!OF7,\"ー\"), ISNUMBER(VALUE(集計用!OF7))), 0, IF(集計用!OF7=\"\", 0, OF12))","v":0},{"$f":"IF(OR(EXACT(集計用!OG7,\"事業概要：\"), EXACT(集計用!OG7,\"ー\"), ISNUMBER(VALUE(集計用!OG7))), 0, IF(集計用!OG7=\"\", 0, OG12))","v":0},{"$f":"IF(OR(EXACT(集計用!OH7,\"事業概要：\"), EXACT(集計用!OH7,\"ー\"), ISNUMBER(VALUE(集計用!OH7))), 0, IF(集計用!OH7=\"\", 0, OH12))","v":0},{"$f":"IF(OR(EXACT(集計用!OI7,\"事業概要：\"), EXACT(集計用!OI7,\"ー\"), ISNUMBER(VALUE(集計用!OI7))), 0, IF(集計用!OI7=\"\", 0, OI12))","v":0},{"$f":"IF(OR(EXACT(集計用!OJ7,\"事業概要：\"), EXACT(集計用!OJ7,\"ー\"), ISNUMBER(VALUE(集計用!OJ7))), 0, IF(集計用!OJ7=\"\", 0, OJ12))","v":0},{"$f":"IF(OR(EXACT(集計用!OK7,\"事業概要：\"), EXACT(集計用!OK7,\"ー\"), ISNUMBER(VALUE(集計用!OK7))), 0, IF(集計用!OK7=\"\", 0, OK12))","v":0},{"$f":"IF(OR(EXACT(集計用!OL7,\"事業概要：\"), EXACT(集計用!OL7,\"ー\"), ISNUMBER(VALUE(集計用!OL7))), 0, IF(集計用!OL7=\"\", 0, OL12))","v":0},{"$f":"IF(OR(EXACT(集計用!OM7,\"事業概要：\"), EXACT(集計用!OM7,\"ー\"), ISNUMBER(VALUE(集計用!OM7))), 0, IF(集計用!OM7=\"\", 0, OM12))","v":0},{"$f":"IF(OR(EXACT(集計用!ON7,\"事業概要：\"), EXACT(集計用!ON7,\"ー\"), ISNUMBER(VALUE(集計用!ON7))), 0, IF(集計用!ON7=\"\", 0, ON12))","v":0},{"$f":"IF(OR(EXACT(集計用!OO7,\"事業概要：\"), EXACT(集計用!OO7,\"ー\"), ISNUMBER(VALUE(集計用!OO7))), 0, IF(集計用!OO7=\"\", 0, OO12))","v":0},{"$f":"IF(OR(EXACT(集計用!OP7,\"事業概要：\"), EXACT(集計用!OP7,\"ー\"), ISNUMBER(VALUE(集計用!OP7))), 0, IF(集計用!OP7=\"\", 0, OP12))","v":0},{"$f":"IF(OR(EXACT(集計用!OQ7,\"事業概要：\"), EXACT(集計用!OQ7,\"ー\"), ISNUMBER(VALUE(集計用!OQ7))), 0, IF(集計用!OQ7=\"\", 0, OQ12))","v":0},{"$f":"IF(OR(EXACT(集計用!OR7,\"事業概要：\"), EXACT(集計用!OR7,\"ー\"), ISNUMBER(VALUE(集計用!OR7))), 0, IF(集計用!OR7=\"\", 0, OR12))","v":0},{"$f":"IF(OR(EXACT(集計用!OS7,\"事業概要：\"), EXACT(集計用!OS7,\"ー\"), ISNUMBER(VALUE(集計用!OS7))), 0, IF(集計用!OS7=\"\", 0, OS12))","v":0},{"$f":"IF(OR(EXACT(集計用!OT7,\"事業概要：\"), EXACT(集計用!OT7,\"ー\"), ISNUMBER(VALUE(集計用!OT7))), 0, IF(集計用!OT7=\"\", 0, OT12))","v":0},{"$f":"IF(OR(EXACT(集計用!OU7,\"事業概要：\"), EXACT(集計用!OU7,\"ー\"), ISNUMBER(VALUE(集計用!OU7))), 0, IF(集計用!OU7=\"\", 0, OU12))","v":0},{"$f":"IF(OR(EXACT(集計用!OV7,\"事業概要：\"), EXACT(集計用!OV7,\"ー\"), ISNUMBER(VALUE(集計用!OV7))), 0, IF(集計用!OV7=\"\", 0, OV12))","v":0},{"$f":"IF(OR(EXACT(集計用!OW7,\"事業概要：\"), EXACT(集計用!OW7,\"ー\"), ISNUMBER(VALUE(集計用!OW7))), 0, IF(集計用!OW7=\"\", 0, OW12))","v":0},{"$f":"IF(OR(EXACT(集計用!OX7,\"事業概要：\"), EXACT(集計用!OX7,\"ー\"), ISNUMBER(VALUE(集計用!OX7))), 0, IF(集計用!OX7=\"\", 0, OX12))","v":0},{"$f":"IF(OR(EXACT(集計用!OY7,\"事業概要：\"), EXACT(集計用!OY7,\"ー\"), ISNUMBER(VALUE(集計用!OY7))), 0, IF(集計用!OY7=\"\", 0, OY12))","v":0},{"$f":"IF(OR(EXACT(集計用!OZ7,\"事業概要：\"), EXACT(集計用!OZ7,\"ー\"), ISNUMBER(VALUE(集計用!OZ7))), 0, IF(集計用!OZ7=\"\", 0, OZ12))","v":0},{"$f":"IF(OR(EXACT(集計用!PA7,\"事業概要：\"), EXACT(集計用!PA7,\"ー\"), ISNUMBER(VALUE(集計用!PA7))), 0, IF(集計用!PA7=\"\", 0, PA12))","v":0},{"$f":"IF(OR(EXACT(集計用!PB7,\"事業概要：\"), EXACT(集計用!PB7,\"ー\"), ISNUMBER(VALUE(集計用!PB7))), 0, IF(集計用!PB7=\"\", 0, PB12))","v":0},{"$f":"IF(OR(EXACT(集計用!PC7,\"事業概要：\"), EXACT(集計用!PC7,\"ー\"), ISNUMBER(VALUE(集計用!PC7))), 0, IF(集計用!PC7=\"\", 0, PC12))","v":0},{"$f":"IF(OR(EXACT(集計用!PD7,\"事業概要：\"), EXACT(集計用!PD7,\"ー\"), ISNUMBER(VALUE(集計用!PD7))), 0, IF(集計用!PD7=\"\", 0, PD12))","v":0},{"$f":"IF(OR(EXACT(集計用!PE7,\"事業概要：\"), EXACT(集計用!PE7,\"ー\"), ISNUMBER(VALUE(集計用!PE7))), 0, IF(集計用!PE7=\"\", 0, PE12))","v":0},{"$f":"IF(OR(EXACT(集計用!PF7,\"事業概要：\"), EXACT(集計用!PF7,\"ー\"), ISNUMBER(VALUE(集計用!PF7))), 0, IF(集計用!PF7=\"\", 0, PF12))","v":0},{"$f":"IF(OR(EXACT(集計用!PG7,\"事業概要：\"), EXACT(集計用!PG7,\"ー\"), ISNUMBER(VALUE(集計用!PG7))), 0, IF(集計用!PG7=\"\", 0, PG12))","v":0},{"$f":"IF(OR(EXACT(集計用!PH7,\"事業概要：\"), EXACT(集計用!PH7,\"ー\"), ISNUMBER(VALUE(集計用!PH7))), 0, IF(集計用!PH7=\"\", 0, PH12))","v":0},{"$f":"IF(OR(EXACT(集計用!PI7,\"事業概要：\"), EXACT(集計用!PI7,\"ー\"), ISNUMBER(VALUE(集計用!PI7))), 0, IF(集計用!PI7=\"\", 0, PI12))","v":0},{"$f":"IF(OR(EXACT(集計用!PJ7,\"事業概要：\"), EXACT(集計用!PJ7,\"ー\"), ISNUMBER(VALUE(集計用!PJ7))), 0, IF(集計用!PJ7=\"\", 0, PJ12))","v":0},{"$f":"IF(OR(EXACT(集計用!PK7,\"事業概要：\"), EXACT(集計用!PK7,\"ー\"), ISNUMBER(VALUE(集計用!PK7))), 0, IF(集計用!PK7=\"\", 0, PK12))","v":0},{"$f":"IF(OR(EXACT(集計用!PL7,\"事業概要：\"), EXACT(集計用!PL7,\"ー\"), ISNUMBER(VALUE(集計用!PL7))), 0, IF(集計用!PL7=\"\", 0, PL12))","v":0},{"$f":"IF(OR(EXACT(集計用!PM7,\"事業概要：\"), EXACT(集計用!PM7,\"ー\"), ISNUMBER(VALUE(集計用!PM7))), 0, IF(集計用!PM7=\"\", 0, PM12))","v":0},{"$f":"IF(OR(EXACT(集計用!PN7,\"事業概要：\"), EXACT(集計用!PN7,\"ー\"), ISNUMBER(VALUE(集計用!PN7))), 0, IF(集計用!PN7=\"\", 0, PN12))","v":0},{"$f":"IF(OR(EXACT(集計用!PO7,\"事業概要：\"), EXACT(集計用!PO7,\"ー\"), ISNUMBER(VALUE(集計用!PO7))), 0, IF(集計用!PO7=\"\", 0, PO12))","v":0},{"$f":"IF(OR(EXACT(集計用!PP7,\"事業概要：\"), EXACT(集計用!PP7,\"ー\"), ISNUMBER(VALUE(集計用!PP7))), 0, IF(集計用!PP7=\"\", 0, PP12))","v":0},{"$f":"IF(OR(EXACT(集計用!PQ7,\"事業概要：\"), EXACT(集計用!PQ7,\"ー\"), ISNUMBER(VALUE(集計用!PQ7))), 0, IF(集計用!PQ7=\"\", 0, PQ12))","v":0},{"$f":"IF(OR(EXACT(集計用!PR7,\"事業概要：\"), EXACT(集計用!PR7,\"ー\"), ISNUMBER(VALUE(集計用!PR7))), 0, IF(集計用!PR7=\"\", 0, PR12))","v":0},{"$f":"IF(OR(EXACT(集計用!PS7,\"事業概要：\"), EXACT(集計用!PS7,\"ー\"), ISNUMBER(VALUE(集計用!PS7))), 0, IF(集計用!PS7=\"\", 0, PS12))","v":0},{"$f":"IF(OR(EXACT(集計用!PT7,\"事業概要：\"), EXACT(集計用!PT7,\"ー\"), ISNUMBER(VALUE(集計用!PT7))), 0, IF(集計用!PT7=\"\", 0, PT12))","v":0},{"$f":"IF(OR(EXACT(集計用!PU7,\"事業概要：\"), EXACT(集計用!PU7,\"ー\"), ISNUMBER(VALUE(集計用!PU7))), 0, IF(集計用!PU7=\"\", 0, PU12))","v":0},{"$f":"IF(OR(EXACT(集計用!PV7,\"事業概要：\"), EXACT(集計用!PV7,\"ー\"), ISNUMBER(VALUE(集計用!PV7))), 0, IF(集計用!PV7=\"\", 0, PV12))","v":0},{"$f":"IF(OR(EXACT(集計用!PW7,\"事業概要：\"), EXACT(集計用!PW7,\"ー\"), ISNUMBER(VALUE(集計用!PW7))), 0, IF(集計用!PW7=\"\", 0, PW12))","v":0},{"$f":"IF(OR(EXACT(集計用!PX7,\"事業概要：\"), EXACT(集計用!PX7,\"ー\"), ISNUMBER(VALUE(集計用!PX7))), 0, IF(集計用!PX7=\"\", 0, PX12))","v":0},{"$f":"IF(OR(EXACT(集計用!PY7,\"事業概要：\"), EXACT(集計用!PY7,\"ー\"), ISNUMBER(VALUE(集計用!PY7))), 0, IF(集計用!PY7=\"\", 0, PY12))","v":0},{"$f":"IF(OR(EXACT(集計用!PZ7,\"事業概要：\"), EXACT(集計用!PZ7,\"ー\"), ISNUMBER(VALUE(集計用!PZ7))), 0, IF(集計用!PZ7=\"\", 0, PZ12))","v":0},{"$f":"IF(OR(EXACT(集計用!QA7,\"事業概要：\"), EXACT(集計用!QA7,\"ー\"), ISNUMBER(VALUE(集計用!QA7))), 0, IF(集計用!QA7=\"\", 0, QA12))","v":0},{"$f":"IF(OR(EXACT(集計用!QB7,\"事業概要：\"), EXACT(集計用!QB7,\"ー\"), ISNUMBER(VALUE(集計用!QB7))), 0, IF(集計用!QB7=\"\", 0, QB12))","v":0},{"$f":"IF(OR(EXACT(集計用!QC7,\"事業概要：\"), EXACT(集計用!QC7,\"ー\"), ISNUMBER(VALUE(集計用!QC7))), 0, IF(集計用!QC7=\"\", 0, QC12))","v":0},{"$f":"IF(OR(EXACT(集計用!QD7,\"事業概要：\"), EXACT(集計用!QD7,\"ー\"), ISNUMBER(VALUE(集計用!QD7))), 0, IF(集計用!QD7=\"\", 0, QD12))","v":0},{"$f":"IF(OR(EXACT(集計用!QE7,\"事業概要：\"), EXACT(集計用!QE7,\"ー\"), ISNUMBER(VALUE(集計用!QE7))), 0, IF(集計用!QE7=\"\", 0, QE12))","v":0},{"$f":"IF(OR(EXACT(集計用!QF7,\"事業概要：\"), EXACT(集計用!QF7,\"ー\"), EXACT(集計用!QF7,0), NOT(ISNUMBER(VALUE(集計用!QF7)))), 0, IF(集計用!QF7=\"\", 0, QF12))","v":0},{"$f":"IF(OR(EXACT(集計用!QG7,\"事業概要：\"), EXACT(集計用!QG7,\"ー\"), ISNUMBER(VALUE(集計用!QG7))), 0, IF(集計用!QG7=\"\", 0, QG12))","v":0},{"$f":"IF(OR(EXACT(集計用!QH7,\"事業概要：\"), EXACT(集計用!QH7,\"ー\"), ISNUMBER(VALUE(集計用!QH7))), 0, IF(集計用!QH7=\"\", 0, QH12))","v":0},{"$f":"IF(OR(EXACT(集計用!QI7,\"事業概要：\"), EXACT(集計用!QI7,\"ー\"), ISNUMBER(VALUE(集計用!QI7))), 0, IF(集計用!QI7=\"\", 0, QI12))","v":0},{"$f":"IF(OR(EXACT(集計用!QJ7,\"事業概要：\"), EXACT(集計用!QJ7,\"ー\"), ISNUMBER(VALUE(集計用!QJ7))), 0, IF(集計用!QJ7=\"\", 0, QJ12))","v":0},{"$f":"IF(OR(EXACT(集計用!QK7,\"事業概要：\"), EXACT(集計用!QK7,\"ー\"), ISNUMBER(VALUE(集計用!QK7))), 0, IF(集計用!QK7=\"\", 0, QK12))","v":0},{"$f":"IF(OR(EXACT(集計用!QL7,\"事業概要：\"), EXACT(集計用!QL7,\"ー\"), ISNUMBER(VALUE(集計用!QL7))), 0, IF(集計用!QL7=\"\", 0, QL12))","v":0},{"$f":"IF(OR(EXACT(集計用!QM7,\"事業概要：\"), EXACT(集計用!QM7,\"ー\"), ISNUMBER(VALUE(集計用!QM7))), 0, IF(集計用!QM7=\"\", 0, QM12))","v":0},{"$f":"IF(OR(EXACT(集計用!QN7,\"事業概要：\"), EXACT(集計用!QN7,\"ー\"), ISNUMBER(VALUE(集計用!QN7))), 0, IF(集計用!QN7=\"\", 0, QN12))","v":0},{"$f":"IF(OR(EXACT(集計用!QO7,\"事業概要：\"), EXACT(集計用!QO7,\"ー\"), ISNUMBER(VALUE(集計用!QO7))), 0, IF(集計用!QO7=\"\", 0, QO12))","v":0},{"$f":"IF(OR(EXACT(集計用!QP7,\"事業概要：\"), EXACT(集計用!QP7,\"ー\"), EXACT(集計用!QP7,0), NOT(ISNUMBER(VALUE(集計用!QP7)))), 0, IF(集計用!QP7=\"\", 0, QP12))","v":0},{"$f":"IF(OR(EXACT(集計用!QQ7,\"事業概要：\"), EXACT(集計用!QQ7,\"ー\"), ISNUMBER(VALUE(集計用!QQ7))), 0, IF(集計用!QQ7=\"\", 0, QQ12))","v":0},{"$f":"IF(OR(EXACT(集計用!QR7,\"事業概要：\"), EXACT(集計用!QR7,\"ー\"), ISNUMBER(VALUE(集計用!QR7))), 0, IF(集計用!QR7=\"\", 0, QR12))","v":0},{"$f":"IF(OR(EXACT(集計用!QS7,\"事業概要：\"), EXACT(集計用!QS7,\"ー\"), ISNUMBER(VALUE(集計用!QS7))), 0, IF(集計用!QS7=\"\", 0, QS12))","v":0},{"$f":"IF(OR(EXACT(集計用!QT7,\"事業概要：\"), EXACT(集計用!QT7,\"ー\"), ISNUMBER(VALUE(集計用!QT7))), 0, IF(集計用!QT7=\"\", 0, QT12))","v":0},{"$f":"IF(OR(EXACT(集計用!QU7,\"事業概要：\"), EXACT(集計用!QU7,\"ー\"), ISNUMBER(VALUE(集計用!QU7))), 0, IF(集計用!QU7=\"\", 0, QU12))","v":0},{"$f":"IF(OR(EXACT(集計用!QV7,\"事業概要：\"), EXACT(集計用!QV7,\"ー\"), ISNUMBER(VALUE(集計用!QV7))), 0, IF(集計用!QV7=\"\", 0, QV12))","v":0},{"$f":"IF(OR(EXACT(集計用!QW7,\"事業概要：\"), EXACT(集計用!QW7,\"ー\"), ISNUMBER(VALUE(集計用!QW7))), 0, IF(集計用!QW7=\"\", 0, QW12))","v":0},{"$f":"IF(OR(EXACT(集計用!QX7,\"事業概要：\"), EXACT(集計用!QX7,\"ー\"), ISNUMBER(VALUE(集計用!QX7))), 0, IF(集計用!QX7=\"\", 0, QX12))","v":0},{"$f":"IF(OR(EXACT(集計用!QY7,\"事業概要：\"), EXACT(集計用!QY7,\"ー\"), ISNUMBER(VALUE(集計用!QY7))), 0, IF(集計用!QY7=\"\", 0, QY12))","v":0},{"$f":"IF(OR(EXACT(集計用!QZ7,\"事業概要：\"), EXACT(集計用!QZ7,\"ー\"), ISNUMBER(VALUE(集計用!QZ7))), 0, IF(集計用!QZ7=\"\", 0, QZ12))","v":0},{"$f":"IF(OR(EXACT(集計用!RA7,\"事業概要：\"), EXACT(集計用!RA7,\"ー\"), ISNUMBER(VALUE(集計用!RA7))), 0, IF(集計用!RA7=\"\", 0, RA12))","v":0},{"$f":"IF(OR(EXACT(集計用!RB7,\"事業概要：\"), EXACT(集計用!RB7,\"ー\"), ISNUMBER(VALUE(集計用!RB7))), 0, IF(集計用!RB7=\"\", 0, RB12))","v":0},{"$f":"IF(OR(EXACT(集計用!RC7,\"事業概要：\"), EXACT(集計用!RC7,\"ー\"), ISNUMBER(VALUE(集計用!RC7))), 0, IF(集計用!RC7=\"\", 0, RC12))","v":0},{"$f":"IF(OR(EXACT(集計用!RD7,\"事業概要：\"), EXACT(集計用!RD7,\"ー\"), ISNUMBER(VALUE(集計用!RD7))), 0, IF(集計用!RD7=\"\", 0, RD12))","v":0},{"$f":"IF(OR(EXACT(集計用!RE7,\"事業概要：\"), EXACT(集計用!RE7,\"ー\"), ISNUMBER(VALUE(集計用!RE7))), 0, IF(集計用!RE7=\"\", 0, RE12))","v":0},{"$f":"IF(OR(EXACT(集計用!RF7,\"事業概要：\"), EXACT(集計用!RF7,\"ー\"), ISNUMBER(VALUE(集計用!RF7))), 0, IF(集計用!RF7=\"\", 0, RF12))","v":0},{"$f":"IF(OR(EXACT(集計用!RG7,\"事業概要：\"), EXACT(集計用!RG7,\"ー\"), ISNUMBER(VALUE(集計用!RG7))), 0, IF(集計用!RG7=\"\", 0, RG12))","v":0},{"$f":"IF(OR(EXACT(集計用!RH7,\"事業概要：\"), EXACT(集計用!RH7,\"ー\"), ISNUMBER(VALUE(集計用!RH7))), 0, IF(集計用!RH7=\"\", 0, RH12))","v":0},{"$f":"IF(OR(EXACT(集計用!RI7,\"事業概要：\"), EXACT(集計用!RI7,\"ー\"), ISNUMBER(VALUE(集計用!RI7))), 0, IF(集計用!RI7=\"\", 0, RI12))","v":0},{"$f":"IF(OR(EXACT(集計用!RJ7,\"事業概要：\"), EXACT(集計用!RJ7,\"ー\"), ISNUMBER(VALUE(集計用!RJ7))), 0, IF(集計用!RJ7=\"\", 0, RJ12))","v":0},{"$f":"IF(OR(EXACT(集計用!RK7,\"事業概要：\"), EXACT(集計用!RK7,\"ー\"), ISNUMBER(VALUE(集計用!RK7))), 0, IF(集計用!RK7=\"\", 0, RK12))","v":0},{"$f":"IF(OR(EXACT(集計用!RL7,\"事業概要：\"), EXACT(集計用!RL7,\"ー\"), ISNUMBER(VALUE(集計用!RL7))), 0, IF(集計用!RL7=\"\", 0, RL12))","v":0},{"$f":"IF(OR(EXACT(集計用!RM7,\"事業概要：\"), EXACT(集計用!RM7,\"ー\"), ISNUMBER(VALUE(集計用!RM7))), 0, IF(集計用!RM7=\"\", 0, RM12))","v":0},{"$f":"IF(OR(EXACT(集計用!RN7,\"事業概要：\"), EXACT(集計用!RN7,\"ー\"), ISNUMBER(VALUE(集計用!RN7))), 0, IF(集計用!RN7=\"\", 0, RN12))","v":0},{"$f":"IF(OR(EXACT(集計用!RO7,\"事業概要：\"), EXACT(集計用!RO7,\"ー\"), ISNUMBER(VALUE(集計用!RO7))), 0, IF(集計用!RO7=\"\", 0, RO12))","v":0},{"$f":"IF(OR(EXACT(集計用!RP7,\"事業概要：\"), EXACT(集計用!RP7,\"ー\"), ISNUMBER(VALUE(集計用!RP7))), 0, IF(集計用!RP7=\"\", 0, RP12))","v":0},{"$f":"IF(OR(EXACT(集計用!RQ7,\"事業概要：\"), EXACT(集計用!RQ7,\"ー\"), ISNUMBER(VALUE(集計用!RQ7))), 0, IF(集計用!RQ7=\"\", 0, RQ12))","v":0},{"$f":"IF(OR(EXACT(集計用!RR7,\"事業概要：\"), EXACT(集計用!RR7,\"ー\"), ISNUMBER(VALUE(集計用!RR7))), 0, IF(集計用!RR7=\"\", 0, RR12))","v":0},{"$f":"IF(OR(EXACT(集計用!RS7,\"事業概要：\"), EXACT(集計用!RS7,\"ー\"), ISNUMBER(VALUE(集計用!RS7))), 0, IF(集計用!RS7=\"\", 0, RS12))","v":0},{"$f":"IF(OR(EXACT(集計用!RT7,\"事業概要：\"), EXACT(集計用!RT7,\"ー\"), ISNUMBER(VALUE(集計用!RT7))), 0, IF(集計用!RT7=\"\", 0, RT12))","v":0},{"$f":"IF(OR(EXACT(集計用!RU7,\"事業概要：\"), EXACT(集計用!RU7,\"ー\"), ISNUMBER(VALUE(集計用!RU7))), 0, IF(集計用!RU7=\"\", 0, RU12))","v":0},{"$f":"IF(OR(EXACT(集計用!RV7,\"事業概要：\"), EXACT(集計用!RV7,\"ー\"), ISNUMBER(VALUE(集計用!RV7))), 0, IF(集計用!RV7=\"\", 0, RV12))","v":0},{"$f":"IF(OR(EXACT(集計用!RW7,\"事業概要：\"), EXACT(集計用!RW7,\"ー\"), ISNUMBER(VALUE(集計用!RW7))), 0, IF(集計用!RW7=\"\", 0, RW12))","v":0},{"$f":"IF(OR(EXACT(集計用!RX7,\"事業概要：\"), EXACT(集計用!RX7,\"ー\"), ISNUMBER(VALUE(集計用!RX7))), 0, IF(集計用!RX7=\"\", 0, RX12))","v":0},{"$f":"IF(OR(EXACT(集計用!RY7,\"事業概要：\"), EXACT(集計用!RY7,\"ー\"), ISNUMBER(VALUE(集計用!RY7))), 0, IF(集計用!RY7=\"\", 0, RY12))","v":0},{"$f":"IF(OR(EXACT(集計用!RZ7,\"事業概要：\"), EXACT(集計用!RZ7,\"ー\"), ISNUMBER(VALUE(集計用!RZ7))), 0, IF(集計用!RZ7=\"\", 0, RZ12))","v":0},{"$f":"IF(OR(EXACT(集計用!SA7,\"事業概要：\"), EXACT(集計用!SA7,\"ー\"), ISNUMBER(VALUE(集計用!SA7))), 0, IF(集計用!SA7=\"\", 0, SA12))","v":0},{"$f":"IF(OR(EXACT(集計用!SB7,\"事業概要：\"), EXACT(集計用!SB7,\"ー\"), ISNUMBER(VALUE(集計用!SB7))), 0, IF(集計用!SB7=\"\", 0, SB12))","v":0},{"$f":"IF(OR(EXACT(集計用!SC7,\"事業概要：\"), EXACT(集計用!SC7,\"ー\"), ISNUMBER(VALUE(集計用!SC7))), 0, IF(集計用!SC7=\"\", 0, SC12))","v":0},{"$f":"IF(OR(EXACT(集計用!SD7,\"事業概要：\"), EXACT(集計用!SD7,\"ー\"), ISNUMBER(VALUE(集計用!SD7))), 0, IF(集計用!SD7=\"\", 0, SD12))","v":0},{"$f":"IF(OR(EXACT(集計用!SE7,\"事業概要：\"), EXACT(集計用!SE7,\"ー\"), ISNUMBER(VALUE(集計用!SE7))), 0, IF(集計用!SE7=\"\", 0, SE12))","v":0},{"$f":"IF(OR(EXACT(集計用!SF7,\"事業概要：\"), EXACT(集計用!SF7,\"ー\"), ISNUMBER(VALUE(集計用!SF7))), 0, IF(集計用!SF7=\"\", 0, SF12))","v":0},{"$f":"IF(OR(EXACT(集計用!SG7,\"事業概要：\"), EXACT(集計用!SG7,\"ー\"), ISNUMBER(VALUE(集計用!SG7))), 0, IF(集計用!SG7=\"\", 0, SG12))","v":0},{"$f":"IF(OR(EXACT(集計用!SH7,\"事業概要：\"), EXACT(集計用!SH7,\"ー\"), ISNUMBER(VALUE(集計用!SH7))), 0, IF(集計用!SH7=\"\", 0, SH12))","v":0},{"$f":"IF(OR(EXACT(集計用!SI7,\"事業概要：\"), EXACT(集計用!SI7,\"ー\"), EXACT(集計用!SI7,0), NOT(ISNUMBER(VALUE(集計用!SI7)))), 0, IF(集計用!SI7=\"\", 0, SI12))","v":0},{"$f":"IF(OR(EXACT(集計用!SJ7,\"事業概要：\"), EXACT(集計用!SJ7,\"ー\"), ISNUMBER(VALUE(集計用!SJ7))), 0, IF(集計用!SJ7=\"\", 0, SJ12))","v":0},{"$f":"IF(OR(EXACT(集計用!SK7,\"事業概要：\"), EXACT(集計用!SK7,\"ー\"), ISNUMBER(VALUE(集計用!SK7))), 0, IF(集計用!SK7=\"\", 0, SK12))","v":0},{"$f":"IF(OR(EXACT(集計用!SL7,\"事業概要：\"), EXACT(集計用!SL7,\"ー\"), ISNUMBER(VALUE(集計用!SL7))), 0, IF(集計用!SL7=\"\", 0, SL12))","v":0},{"$f":"IF(OR(EXACT(集計用!SM7,\"事業概要：\"), EXACT(集計用!SM7,\"ー\"), ISNUMBER(VALUE(集計用!SM7))), 0, IF(集計用!SM7=\"\", 0, SM12))","v":0},{"$f":"IF(OR(EXACT(集計用!SN7,\"事業概要：\"), EXACT(集計用!SN7,\"ー\"), ISNUMBER(VALUE(集計用!SN7))), 0, IF(集計用!SN7=\"\", 0, SN12))","v":0},{"$f":"IF(OR(EXACT(集計用!SO7,\"事業概要：\"), EXACT(集計用!SO7,\"ー\"), ISNUMBER(VALUE(集計用!SO7))), 0, IF(集計用!SO7=\"\", 0, SO12))","v":0},{"$f":"IF(OR(EXACT(集計用!SP7,\"事業概要：\"), EXACT(集計用!SP7,\"ー\"), ISNUMBER(VALUE(集計用!SP7))), 0, IF(集計用!SP7=\"\", 0, SP12))","v":0},{"$f":"IF(OR(EXACT(集計用!SQ7,\"事業概要：\"), EXACT(集計用!SQ7,\"ー\"), ISNUMBER(VALUE(集計用!SQ7))), 0, IF(集計用!SQ7=\"\", 0, SQ12))","v":0},{"$f":"IF(OR(EXACT(集計用!SR7,\"事業概要：\"), EXACT(集計用!SR7,\"ー\"), ISNUMBER(VALUE(集計用!SR7))), 0, IF(集計用!SR7=\"\", 0, SR12))","v":0},{"$f":"IF(OR(EXACT(集計用!SS7,\"事業概要：\"), EXACT(集計用!SS7,\"ー\"), ISNUMBER(VALUE(集計用!SS7))), 0, IF(集計用!SS7=\"\", 0, SS12))","v":0},{"$f":"IF(OR(EXACT(集計用!ST7,\"事業概要：\"), EXACT(集計用!ST7,\"ー\"), ISNUMBER(VALUE(集計用!ST7))), 0, IF(集計用!ST7=\"\", 0, ST12))","v":0},{"$f":"IF(OR(EXACT(集計用!SU7,\"事業概要：\"), EXACT(集計用!SU7,\"ー\"), EXACT(集計用!SU7,0), NOT(ISNUMBER(VALUE(集計用!SU7)))), 0, IF(集計用!SU7=\"\", 0, SU12))","v":0},{"$f":"IF(OR(EXACT(集計用!SV7,\"事業概要：\"), EXACT(集計用!SV7,\"ー\"), EXACT(集計用!SV7,0), NOT(ISNUMBER(VALUE(集計用!SV7)))), 0, IF(集計用!SV7=\"\", 0, SV12))","v":0},{"$f":"IF(OR(EXACT(集計用!SW7,\"事業概要：\"), EXACT(集計用!SW7,\"ー\"), ISNUMBER(VALUE(集計用!SW7))), 0, IF(集計用!SW7=\"\", 0, SW12))","v":0},{"$f":"IF(OR(EXACT(集計用!SX7,\"事業概要：\"), EXACT(集計用!SX7,\"ー\"), ISNUMBER(VALUE(集計用!SX7))), 0, IF(集計用!SX7=\"\", 0, SX12))","v":0},{"$f":"IF(OR(EXACT(集計用!SY7,\"事業概要：\"), EXACT(集計用!SY7,\"ー\"), ISNUMBER(VALUE(集計用!SY7))), 0, IF(集計用!SY7=\"\", 0, SY12))","v":0},{"$f":"IF(OR(EXACT(集計用!SZ7,\"事業概要：\"), EXACT(集計用!SZ7,\"ー\"), ISNUMBER(VALUE(集計用!SZ7))), 0, IF(集計用!SZ7=\"\", 0, SZ12))","v":0},{"$f":"IF(OR(EXACT(集計用!TA7,\"事業概要：\"), EXACT(集計用!TA7,\"ー\"), ISNUMBER(VALUE(集計用!TA7))), 0, IF(集計用!TA7=\"\", 0, TA12))","v":0},{"$f":"IF(OR(EXACT(集計用!TB7,\"事業概要：\"), EXACT(集計用!TB7,\"ー\"), ISNUMBER(VALUE(集計用!TB7))), 0, IF(集計用!TB7=\"\", 0, TB12))","v":0},{"$f":"IF(OR(EXACT(集計用!TC7,\"事業概要：\"), EXACT(集計用!TC7,\"ー\"), ISNUMBER(VALUE(集計用!TC7))), 0, IF(集計用!TC7=\"\", 0, TC12))","v":0},{"$f":"IF(OR(EXACT(集計用!TD7,\"事業概要：\"), EXACT(集計用!TD7,\"ー\"), ISNUMBER(VALUE(集計用!TD7))), 0, IF(集計用!TD7=\"\", 0, TD12))","v":0},{"$f":"IF(OR(EXACT(集計用!TE7,\"事業概要：\"), EXACT(集計用!TE7,\"ー\"), ISNUMBER(VALUE(集計用!TE7))), 0, IF(集計用!TE7=\"\", 0, TE12))","v":0},{"$f":"IF(OR(EXACT(集計用!TF7,\"事業概要：\"), EXACT(集計用!TF7,\"ー\"), EXACT(集計用!TF7,0), NOT(ISNUMBER(VALUE(集計用!TF7)))), 0, IF(集計用!TF7=\"\", 0, TF12))","v":0}]
[{"$f":"IF(OR(EXACT(集計用!A7,\"事業概要：\"),EXACT(集計用!A7,\"ー\"),集計用!A7=0,集計用!A7=\"\"),0,1)","v":0},{"$f":"IF(OR(EXACT(集計用!B7,\"事業概要：\"),EXACT(集計用!B7,\"ー\"),集計用!B7=0,集計用!B7=\"\"),0,1)","v":0},{"$f":"IF(OR(EXACT(集計用!C7,\"事業概要：\"),EXACT(集計用!C7,\"ー\"),集計用!C7=0,集計用!C7=\"\"),0,1)","v":0},{"$f":"IF(OR(EXACT(集計用!D7,\"事業概要：\"),EXACT(集計用!D7,\"ー\"),集計用!D7=0,集計用!D7=\"\"),0,1)","v":0},{"$f":"IF(OR(EXACT(集計用!E7,\"事業概要：\"),EXACT(集計用!E7,\"ー\"),集計用!E7=0,集計用!E7=\"\"),0,1)","v":0},{"$f":"IF(OR(EXACT(集計用!F7,\"事業概要：\"),EXACT(集計用!F7,\"ー\"),集計用!F7=0,集計用!F7=\"\"),0,1)","v":0},{"$f":"IF(OR(EXACT(集計用!G7,\"事業概要：\"),EXACT(集計用!G7,\"ー\"),集計用!G7=0,集計用!G7=\"\"),0,1)","v":0},{"$f":"IF(OR(EXACT(集計用!H7,\"事業概要：\"),EXACT(集計用!H7,\"ー\"),集計用!H7=0,集計用!H7=\"\"),0,1)","v":0},{"$f":"IF(OR(EXACT(集計用!I7,\"事業概要：\"),EXACT(集計用!I7,\"ー\"),集計用!I7=0,集計用!I7=\"\"),0,1)","v":0},{"$f":"IF(OR(EXACT(集計用!J7,\"事業概要：\"),EXACT(集計用!J7,\"ー\"),集計用!J7=0,集計用!J7=\"\"),0,1)","v":0},{"$f":"IF(OR(EXACT(集計用!K7,\"事業概要：\"),EXACT(集計用!K7,\"ー\"),集計用!K7=0,集計用!K7=\"\"),0,1)","v":0},{"$f":"IF(OR(EXACT(集計用!L7,\"事業概要：\"),EXACT(集計用!L7,\"ー\"),集計用!L7=0,集計用!L7=\"\"),0,1)","v":0},{"$f":"IF(OR(EXACT(集計用!M7,\"事業概要：\"),EXACT(集計用!M7,\"ー\"),集計用!M7=0,集計用!M7=\"\"),0,1)","v":0},{"$f":"IF(OR(EXACT(集計用!N7,\"事業概要：\"),EXACT(集計用!N7,\"ー\"),集計用!N7=0,集計用!N7=\"\"),0,1)","v":0},{"$f":"IF(OR(EXACT(集計用!O7,\"事業概要：\"),EXACT(集計用!O7,\"ー\"),集計用!O7=0,集計用!O7=\"\"),0,1)","v":0},{"$f":"IF(OR(EXACT(集計用!P7,\"事業概要：\"),EXACT(集計用!P7,\"ー\"),集計用!P7=0,集計用!P7=\"\"),0,1)","v":0},{"$f":"IF(OR(EXACT(集計用!Q7,\"事業概要：\"),EXACT(集計用!Q7,\"ー\"),集計用!Q7=0,集計用!Q7=\"\"),0,1)","v":0},{"$f":"IF(OR(EXACT(集計用!R7,\"事業概要：\"),EXACT(集計用!R7,\"ー\"),集計用!R7=0,集計用!R7=\"\"),0,1)","v":0},{"$f":"IF(OR(EXACT(集計用!S7,\"事業概要：\"),EXACT(集計用!S7,\"ー\"),集計用!S7=0,集計用!S7=\"\"),0,1)","v":0},{"$f":"IF(OR(EXACT(集計用!T7,\"事業概要：\"),EXACT(集計用!T7,\"ー\"),集計用!T7=0,集計用!T7=\"\"),0,1)","v":0},{"$f":"IF(OR(EXACT(集計用!U7,\"事業概要：\"),EXACT(集計用!U7,\"ー\"),集計用!U7=0,集計用!U7=\"\"),0,1)","v":0},{"$f":"IF(OR(EXACT(集計用!V7,\"事業概要：\"),EXACT(集計用!V7,\"ー\"),集計用!V7=0,集計用!V7=\"\"),0,1)","v":0},{"$f":"IF(OR(EXACT(集計用!W7,\"事業概要：\"),EXACT(集計用!W7,\"ー\"),集計用!W7=0,集計用!W7=\"\"),0,1)","v":0},{"$f":"IF(OR(EXACT(集計用!X7,\"事業概要：\"),EXACT(集計用!X7,\"ー\"),集計用!X7=0,集計用!X7=\"\"),0,1)","v":0},{"$f":"IF(OR(EXACT(集計用!Y7,\"事業概要：\"),EXACT(集計用!Y7,\"ー\"),集計用!Y7=0,集計用!Y7=\"\"),0,1)","v":0},{"$f":"IF(OR(EXACT(集計用!Z7,\"事業概要：\"),EXACT(集計用!Z7,\"ー\"),集計用!Z7=0,集計用!Z7=\"\"),0,1)","v":0},{"$f":"IF(OR(EXACT(集計用!AA7,\"事業概要：\"),EXACT(集計用!AA7,\"ー\"),集計用!AA7=0,集計用!AA7=\"\"),0,1)","v":0},{"$f":"IF(OR(EXACT(集計用!AB7,\"事業概要：\"),EXACT(集計用!AB7,\"ー\"),集計用!AB7=0,集計用!AB7=\"\"),0,1)","v":0},{"$f":"IF(OR(EXACT(集計用!AC7,\"事業概要：\"),EXACT(集計用!AC7,\"ー\"),集計用!AC7=0,集計用!AC7=\"\"),0,1)","v":0},{"$f":"IF(OR(EXACT(集計用!AD7,\"事業概要：\"),EXACT(集計用!AD7,\"ー\"),集計用!AD7=0,集計用!AD7=\"\"),0,1)","v":0},{"$f":"IF(OR(EXACT(集計用!AE7,\"事業概要：\"),EXACT(集計用!AE7,\"ー\"),集計用!AE7=0,集計用!AE7=\"\"),0,1)","v":0},{"$f":"IF(OR(EXACT(集計用!AF7,\"事業概要：\"),EXACT(集計用!AF7,\"ー\"),集計用!AF7=0,集計用!AF7=\"\"),0,1)","v":0},{"$f":"IF(OR(EXACT(集計用!AG7,\"事業概要：\"),EXACT(集計用!AG7,\"ー\"),集計用!AG7=0,集計用!AG7=\"\"),0,1)","v":0},{"$f":"IF(OR(EXACT(集計用!AH7,\"事業概要：\"),EXACT(集計用!AH7,\"ー\"),集計用!AH7=0,集計用!AH7=\"\"),0,1)","v":0},{"$f":"IF(OR(EXACT(集計用!AI7,\"事業概要：\"),EXACT(集計用!AI7,\"ー\"),集計用!AI7=0,集計用!AI7=\"\"),0,1)","v":0},{"$f":"IF(OR(EXACT(集計用!AJ7,\"事業概要：\"),EXACT(集計用!AJ7,\"ー\"),集計用!AJ7=0,集計用!AJ7=\"\"),0,1)","v":0},{"$f":"IF(OR(EXACT(集計用!AK7,\"事業概要：\"),EXACT(集計用!AK7,\"ー\"),集計用!AK7=0,集計用!AK7=\"\"),0,1)","v":0},{"$f":"IF(OR(EXACT(集計用!AL7,\"事業概要：\"),EXACT(集計用!AL7,\"ー\"),集計用!AL7=0,集計用!AL7=\"\"),0,1)","v":0},{"$f":"IF(OR(EXACT(集計用!AM7,\"事業概要：\"),EXACT(集計用!AM7,\"ー\"),集計用!AM7=0,集計用!AM7=\"\"),0,1)","v":0},{"$f":"IF(OR(EXACT(集計用!AN7,\"事業概要：\"),EXACT(集計用!AN7,\"ー\"),集計用!AN7=0,集計用!AN7=\"\"),0,1)","v":0},{"$f":"IF(OR(EXACT(集計用!AO7,\"事業概要：\"),EXACT(集計用!AO7,\"ー\"),集計用!AO7=0,集計用!AO7=\"\"),0,1)","v":0},{"$f":"IF(OR(EXACT(集計用!AP7,\"事業概要：\"),EXACT(集計用!AP7,\"ー\"),集計用!AP7=0,集計用!AP7=\"\"),0,1)","v":0},{"$f":"IF(OR(EXACT(集計用!AQ7,\"事業概要：\"),EXACT(集計用!AQ7,\"ー\"),集計用!AQ7=0,集計用!AQ7=\"\"),0,1)","v":0},{"$f":"IF(OR(EXACT(集計用!AR7,\"事業概要：\"),EXACT(集計用!AR7,\"ー\"),集計用!AR7=0,集計用!AR7=\"\"),0,1)","v":0},{"$f":"IF(OR(EXACT(集計用!AS7,\"事業概要：\"),EXACT(集計用!AS7,\"ー\"),集計用!AS7=0,集計用!AS7=\"\"),0,1)","v":0},{"$f":"IF(OR(EXACT(集計用!AT7,\"事業概要：\"),EXACT(集計用!AT7,\"ー\"),集計用!AT7=0,集計用!AT7=\"\"),0,1)","v":0},{"$f":"IF(OR(EXACT(集計用!AU7,\"事業概要：\"),EXACT(集計用!AU7,\"ー\"),集計用!AU7=0,集計用!AU7=\"\"),0,1)","v":0},{"$f":"IF(OR(EXACT(集計用!AV7,\"事業概要：\"),EXACT(集計用!AV7,\"ー\"),集計用!AV7=0,集計用!AV7=\"\"),0,1)","v":0},{"$f":"IF(OR(EXACT(集計用!AW7,\"事業概要：\"),EXACT(集計用!AW7,\"ー\"),集計用!AW7=0,集計用!AW7=\"\"),0,1)","v":0},{"$f":"IF(OR(EXACT(集計用!AX7,\"事業概要：\"),EXACT(集計用!AX7,\"ー\"),集計用!AX7=0,集計用!AX7=\"\"),0,1)","v":0},{"$f":"IF(OR(EXACT(集計用!AY7,\"事業概要：\"),EXACT(集計用!AY7,\"ー\"),集計用!AY7=0,集計用!AY7=\"\"),0,1)","v":0},{"$f":"IF(OR(EXACT(集計用!AZ7,\"事業概要：\"),EXACT(集計用!AZ7,\"ー\"),集計用!AZ7=0,集計用!AZ7=\"\"),0,1)","v":0},{"$f":"IF(OR(EXACT(集計用!BA7,\"事業概要：\"),EXACT(集計用!BA7,\"ー\"),集計用!BA7=0,集計用!BA7=\"\"),0,1)","v":0},{"$f":"IF(OR(EXACT(集計用!BB7,\"事業概要：\"),EXACT(集計用!BB7,\"ー\"),集計用!BB7=0,集計用!BB7=\"\"),0,1)","v":0},{"$f":"IF(OR(EXACT(集計用!BC7,\"事業概要：\"),EXACT(集計用!BC7,\"ー\"),集計用!BC7=0,集計用!BC7=\"\"),0,1)","v":0},{"$f":"IF(OR(EXACT(集計用!BD7,\"事業概要：\"),EXACT(集計用!BD7,\"ー\"),集計用!BD7=0,集計用!BD7=\"\"),0,1)","v":0},{"$f":"IF(OR(EXACT(集計用!BE7,\"事業概要：\"),EXACT(集計用!BE7,\"ー\"),集計用!BE7=0,集計用!BE7=\"\"),0,1)","v":0},{"$f":"IF(OR(EXACT(集計用!BF7,\"事業概要：\"),EXACT(集計用!BF7,\"ー\"),集計用!BF7=0,集計用!BF7=\"\"),0,1)","v":0},{"$f":"IF(OR(EXACT(集計用!BG7,\"事業概要：\"),EXACT(集計用!BG7,\"ー\"),集計用!BG7=0,集計用!BG7=\"\"),0,1)","v":0},{"$f":"IF(OR(EXACT(集計用!BH7,\"事業概要：\"),EXACT(集計用!BH7,\"ー\"),集計用!BH7=0,集計用!BH7=\"\"),0,1)","v":0},{"$f":"IF(OR(EXACT(集計用!BI7,\"事業概要：\"),EXACT(集計用!BI7,\"ー\"),集計用!BI7=0,集計用!BI7=\"\"),0,1)","v":0},{"$f":"IF(OR(EXACT(集計用!BJ7,\"事業概要：\"),EXACT(集計用!BJ7,\"ー\"),集計用!BJ7=0,集計用!BJ7=\"\"),0,1)","v":0},{"$f":"IF(OR(EXACT(集計用!BK7,\"事業概要：\"),EXACT(集計用!BK7,\"ー\"),集計用!BK7=0,集計用!BK7=\"\"),0,1)","v":0},{"$f":"IF(OR(EXACT(集計用!BL7,\"事業概要：\"),EXACT(集計用!BL7,\"ー\"),集計用!BL7=0,集計用!BL7=\"\"),0,1)","v":0},{"$f":"IF(OR(EXACT(集計用!BM7,\"事業概要：\"),EXACT(集計用!BM7,\"ー\"),集計用!BM7=0,集計用!BM7=\"\"),0,1)","v":0},{"$f":"IF(OR(EXACT(集計用!BN7,\"事業概要：\"),EXACT(集計用!BN7,\"ー\"),集計用!BN7=0,集計用!BN7=\"\"),0,1)","v":0},{"$f":"IF(OR(EXACT(集計用!BO7,\"事業概要：\"),EXACT(集計用!BO7,\"ー\"),集計用!BO7=0,集計用!BO7=\"\"),0,1)","v":0},{"$f":"IF(OR(EXACT(集計用!BP7,\"事業概要：\"),EXACT(集計用!BP7,\"ー\"),集計用!BP7=0,集計用!BP7=\"\"),0,1)","v":0},{"$f":"IF(OR(EXACT(集計用!BQ7,\"事業概要：\"),EXACT(集計用!BQ7,\"ー\"),集計用!BQ7=0,集計用!BQ7=\"\"),0,1)","v":0},{"$f":"IF(OR(EXACT(集計用!BR7,\"事業概要：\"),EXACT(集計用!BR7,\"ー\"),集計用!BR7=0,集計用!BR7=\"\"),0,1)","v":0},{"$f":"IF(OR(EXACT(集計用!BS7,\"事業概要：\"),EXACT(集計用!BS7,\"ー\"),集計用!BS7=0,集計用!BS7=\"\"),0,1)","v":0},{"$f":"IF(OR(EXACT(集計用!BT7,\"事業概要：\"),EXACT(集計用!BT7,\"ー\"),集計用!BT7=0,集計用!BT7=\"\"),0,1)","v":0},{"$f":"IF(OR(EXACT(集計用!BU7,\"事業概要：\"),EXACT(集計用!BU7,\"ー\"),集計用!BU7=0,集計用!BU7=\"\"),0,1)","v":0},{"$f":"IF(OR(EXACT(集計用!BV7,\"事業概要：\"),EXACT(集計用!BV7,\"ー\"),集計用!BV7=0,集計用!BV7=\"\"),0,1)","v":0},{"$f":"IF(OR(EXACT(集計用!BW7,\"事業概要：\"),EXACT(集計用!BW7,\"ー\"),集計用!BW7=0,集計用!BW7=\"\"),0,1)","v":0},{"$f":"IF(OR(EXACT(集計用!BX7,\"事業概要：\"),EXACT(集計用!BX7,\"ー\"),集計用!BX7=0,集計用!BX7=\"\"),0,1)","v":0},{"$f":"IF(OR(EXACT(集計用!BY7,\"事業概要：\"),EXACT(集計用!BY7,\"ー\"),集計用!BY7=0,集計用!BY7=\"\"),0,1)","v":0},{"$f":"IF(OR(EXACT(集計用!BZ7,\"事業概要：\"),EXACT(集計用!BZ7,\"ー\"),集計用!BZ7=0,集計用!BZ7=\"\"),0,1)","v":0},{"$f":"IF(OR(EXACT(集計用!CA7,\"事業概要：\"),EXACT(集計用!CA7,\"ー\"),集計用!CA7=0,集計用!CA7=\"\"),0,1)","v":0},{"$f":"IF(OR(EXACT(集計用!CB7,\"事業概要：\"),EXACT(集計用!CB7,\"ー\"),集計用!CB7=0,集計用!CB7=\"\"),0,1)","v":0},{"$f":"IF(OR(EXACT(集計用!CC7,\"事業概要：\"),EXACT(集計用!CC7,\"ー\"),集計用!CC7=0,集計用!CC7=\"\"),0,1)","v":0},{"$f":"IF(OR(EXACT(集計用!CD7,\"事業概要：\"),EXACT(集計用!CD7,\"ー\"),集計用!CD7=0,集計用!CD7=\"\"),0,1)","v":0},{"$f":"IF(OR(EXACT(集計用!CE7,\"事業概要：\"),EXACT(集計用!CE7,\"ー\"),集計用!CE7=0,集計用!CE7=\"\"),0,1)","v":0},{"$f":"IF(OR(EXACT(集計用!CF7,\"事業概要：\"),EXACT(集計用!CF7,\"ー\"),集計用!CF7=0,集計用!CF7=\"\"),0,1)","v":0},{"$f":"IF(OR(EXACT(集計用!CG7,\"事業概要：\"),EXACT(集計用!CG7,\"ー\"),集計用!CG7=0,集計用!CG7=\"\"),0,1)","v":0},{"$f":"IF(OR(EXACT(集計用!CH7,\"事業概要：\"),EXACT(集計用!CH7,\"ー\"),集計用!CH7=0,集計用!CH7=\"\"),0,1)","v":0},{"$f":"IF(OR(EXACT(集計用!CI7,\"事業概要：\"),EXACT(集計用!CI7,\"ー\"),集計用!CI7=0,集計用!CI7=\"\"),0,1)","v":0},{"$f":"IF(OR(EXACT(集計用!CJ7,\"事業概要：\"),EXACT(集計用!CJ7,\"ー\"),集計用!CJ7=0,集計用!CJ7=\"\"),0,1)","v":0},{"$f":"IF(OR(EXACT(集計用!CK7,\"事業概要：\"),EXACT(集計用!CK7,\"ー\"),集計用!CK7=0,集計用!CK7=\"\"),0,1)","v":0},{"$f":"IF(OR(EXACT(集計用!CL7,\"事業概要：\"),EXACT(集計用!CL7,\"ー\"),集計用!CL7=0,集計用!CL7=\"\"),0,1)","v":0},{"$f":"IF(OR(EXACT(集計用!CM7,\"事業概要：\"),EXACT(集計用!CM7,\"ー\"),集計用!CM7=0,集計用!CM7=\"\"),0,1)","v":0},{"$f":"IF(OR(EXACT(集計用!CN7,\"事業概要：\"),EXACT(集計用!CN7,\"ー\"),集計用!CN7=0,集計用!CN7=\"\"),0,1)","v":0},{"$f":"IF(OR(EXACT(集計用!CO7,\"事業概要：\"),EXACT(集計用!CO7,\"ー\"),集計用!CO7=0,集計用!CO7=\"\"),0,1)","v":0},{"$f":"IF(OR(EXACT(集計用!CP7,\"事業概要：\"),EXACT(集計用!CP7,\"ー\"),集計用!CP7=0,集計用!CP7=\"\"),0,1)","v":0},{"$f":"IF(OR(EXACT(集計用!CQ7,\"事業概要：\"),EXACT(集計用!CQ7,\"ー\"),集計用!CQ7=0,集計用!CQ7=\"\"),0,1)","v":0},{"$f":"IF(OR(EXACT(集計用!CR7,\"事業概要：\"),EXACT(集計用!CR7,\"ー\"),集計用!CR7=0,集計用!CR7=\"\"),0,1)","v":0},{"$f":"IF(OR(EXACT(集計用!CS7,\"事業概要：\"),EXACT(集計用!CS7,\"ー\"),集計用!CS7=0,集計用!CS7=\"\"),0,1)","v":0},{"$f":"IF(OR(EXACT(集計用!CT7,\"事業概要：\"),EXACT(集計用!CT7,\"ー\"),集計用!CT7=0,集計用!CT7=\"\"),0,1)","v":0},{"$f":"IF(OR(EXACT(集計用!CU7,\"事業概要：\"),EXACT(集計用!CU7,\"ー\"),集計用!CU7=0,集計用!CU7=\"\"),0,1)","v":0},{"$f":"IF(OR(EXACT(集計用!CV7,\"事業概要：\"),EXACT(集計用!CV7,\"ー\"),集計用!CV7=0,集計用!CV7=\"\"),0,1)","v":0},{"$f":"IF(OR(EXACT(集計用!CW7,\"事業概要：\"),EXACT(集計用!CW7,\"ー\"),集計用!CW7=0,集計用!CW7=\"\"),0,1)","v":0},{"$f":"IF(OR(EXACT(集計用!CX7,\"事業概要：\"),EXACT(集計用!CX7,\"ー\"),集計用!CX7=0,集計用!CX7=\"\"),0,1)","v":0},{"$f":"IF(OR(EXACT(集計用!CY7,\"事業概要：\"),EXACT(集計用!CY7,\"ー\"),集計用!CY7=0,集計用!CY7=\"\"),0,1)","v":0},{"$f":"IF(OR(EXACT(集計用!CZ7,\"事業概要：\"),EXACT(集計用!CZ7,\"ー\"),集計用!CZ7=0,集計用!CZ7=\"\"),0,1)","v":0},{"$f":"IF(OR(EXACT(集計用!DA7,\"事業概要：\"),EXACT(集計用!DA7,\"ー\"),集計用!DA7=0,集計用!DA7=\"\"),0,1)","v":0},{"$f":"IF(OR(EXACT(集計用!DB7,\"事業概要：\"),EXACT(集計用!DB7,\"ー\"),集計用!DB7=0,集計用!DB7=\"\"),0,1)","v":0},{"$f":"IF(OR(EXACT(集計用!DC7,\"事業概要：\"),EXACT(集計用!DC7,\"ー\"),集計用!DC7=0,集計用!DC7=\"\"),0,1)","v":0},{"$f":"IF(OR(EXACT(集計用!DD7,\"事業概要：\"),EXACT(集計用!DD7,\"ー\"),集計用!DD7=0,集計用!DD7=\"\"),0,1)","v":0},{"$f":"IF(OR(EXACT(集計用!DE7,\"事業概要：\"),EXACT(集計用!DE7,\"ー\"),集計用!DE7=0,集計用!DE7=\"\"),0,1)","v":0},{"$f":"IF(OR(EXACT(集計用!DF7,\"事業概要：\"),EXACT(集計用!DF7,\"ー\"),集計用!DF7=0,集計用!DF7=\"\"),0,1)","v":0},{"$f":"IF(OR(EXACT(集計用!DG7,\"事業概要：\"),EXACT(集計用!DG7,\"ー\"),集計用!DG7=0,集計用!DG7=\"\"),0,1)","v":0},{"$f":"IF(OR(EXACT(集計用!DH7,\"事業概要：\"),EXACT(集計用!DH7,\"ー\"),集計用!DH7=0,集計用!DH7=\"\"),0,1)","v":0},{"$f":"IF(OR(EXACT(集計用!DI7,\"事業概要：\"),EXACT(集計用!DI7,\"ー\"),集計用!DI7=0,集計用!DI7=\"\"),0,1)","v":0},{"$f":"IF(OR(EXACT(集計用!DJ7,\"事業概要：\"),EXACT(集計用!DJ7,\"ー\"),集計用!DJ7=0,集計用!DJ7=\"\"),0,1)","v":0},{"$f":"IF(OR(EXACT(集計用!DK7,\"事業概要：\"),EXACT(集計用!DK7,\"ー\"),集計用!DK7=0,集計用!DK7=\"\"),0,1)","v":0},{"$f":"IF(OR(EXACT(集計用!DL7,\"事業概要：\"),EXACT(集計用!DL7,\"ー\"),集計用!DL7=0,集計用!DL7=\"\"),0,1)","v":0},{"$f":"IF(OR(EXACT(集計用!DM7,\"事業概要：\"),EXACT(集計用!DM7,\"ー\"),集計用!DM7=0,集計用!DM7=\"\"),0,1)","v":0},{"$f":"IF(OR(EXACT(集計用!DN7,\"事業概要：\"),EXACT(集計用!DN7,\"ー\"),集計用!DN7=0,集計用!DN7=\"\"),0,1)","v":0},{"$f":"IF(OR(EXACT(集計用!DO7,\"事業概要：\"),EXACT(集計用!DO7,\"ー\"),集計用!DO7=0,集計用!DO7=\"\"),0,1)","v":0},{"$f":"IF(OR(EXACT(集計用!DP7,\"事業概要：\"),EXACT(集計用!DP7,\"ー\"),集計用!DP7=0,集計用!DP7=\"\"),0,1)","v":0},{"$f":"IF(OR(EXACT(集計用!DQ7,\"事業概要：\"),EXACT(集計用!DQ7,\"ー\"),集計用!DQ7=0,集計用!DQ7=\"\"),0,1)","v":0},{"$f":"IF(OR(EXACT(集計用!DR7,\"事業概要：\"),EXACT(集計用!DR7,\"ー\"),集計用!DR7=0,集計用!DR7=\"\"),0,1)","v":0},{"$f":"IF(OR(EXACT(集計用!DS7,\"事業概要：\"),EXACT(集計用!DS7,\"ー\"),集計用!DS7=0,集計用!DS7=\"\"),0,1)","v":0},{"$f":"IF(OR(EXACT(集計用!DT7,\"事業概要：\"),EXACT(集計用!DT7,\"ー\"),集計用!DT7=0,集計用!DT7=\"\"),0,1)","v":0},{"$f":"IF(OR(EXACT(集計用!DU7,\"事業概要：\"),EXACT(集計用!DU7,\"ー\"),集計用!DU7=0,集計用!DU7=\"\"),0,1)","v":0},{"$f":"IF(OR(EXACT(集計用!DV7,\"事業概要：\"),EXACT(集計用!DV7,\"ー\"),集計用!DV7=0,集計用!DV7=\"\"),0,1)","v":0},{"$f":"IF(OR(EXACT(集計用!DW7,\"事業概要：\"),EXACT(集計用!DW7,\"ー\"),集計用!DW7=0,集計用!DW7=\"\"),0,1)","v":0},{"$f":"IF(OR(EXACT(集計用!DX7,\"事業概要：\"),EXACT(集計用!DX7,\"ー\"),集計用!DX7=0,集計用!DX7=\"\"),0,1)","v":0},{"$f":"IF(OR(EXACT(集計用!DY7,\"事業概要：\"),EXACT(集計用!DY7,\"ー\"),集計用!DY7=0,集計用!DY7=\"\"),0,1)","v":0},{"$f":"IF(OR(EXACT(集計用!DZ7,\"事業概要：\"),EXACT(集計用!DZ7,\"ー\"),集計用!DZ7=0,集計用!DZ7=\"\"),0,1)","v":0},{"$f":"IF(OR(EXACT(集計用!EA7,\"事業概要：\"),EXACT(集計用!EA7,\"ー\"),集計用!EA7=0,集計用!EA7=\"\"),0,1)","v":0},{"$f":"IF(OR(EXACT(集計用!EB7,\"事業概要：\"),EXACT(集計用!EB7,\"ー\"),集計用!EB7=0,集計用!EB7=\"\"),0,1)","v":0},{"$f":"IF(OR(EXACT(集計用!EC7,\"事業概要：\"),EXACT(集計用!EC7,\"ー\"),集計用!EC7=0,集計用!EC7=\"\"),0,1)","v":0},{"$f":"IF(OR(EXACT(集計用!ED7,\"事業概要：\"),EXACT(集計用!ED7,\"ー\"),集計用!ED7=0,集計用!ED7=\"\"),0,1)","v":0},{"$f":"IF(OR(EXACT(集計用!EE7,\"事業概要：\"),EXACT(集計用!EE7,\"ー\"),集計用!EE7=0,集計用!EE7=\"\"),0,1)","v":0},{"$f":"IF(OR(EXACT(集計用!EF7,\"事業概要：\"),EXACT(集計用!EF7,\"ー\"),集計用!EF7=0,集計用!EF7=\"\"),0,1)","v":0},{"$f":"IF(OR(EXACT(集計用!EG7,\"事業概要：\"),EXACT(集計用!EG7,\"ー\"),集計用!EG7=0,集計用!EG7=\"\"),0,1)","v":0},{"$f":"IF(OR(EXACT(集計用!EH7,\"事業概要：\"),EXACT(集計用!EH7,\"ー\"),集計用!EH7=0,集計用!EH7=\"\"),0,1)","v":0},{"$f":"IF(OR(EXACT(集計用!EI7,\"事業概要：\"),EXACT(集計用!EI7,\"ー\"),集計用!EI7=0,集計用!EI7=\"\"),0,1)","v":0},{"$f":"IF(OR(EXACT(集計用!EJ7,\"事業概要：\"),EXACT(集計用!EJ7,\"ー\"),集計用!EJ7=0,集計用!EJ7=\"\"),0,1)","v":0},{"$f":"IF(OR(EXACT(集計用!EK7,\"事業概要：\"),EXACT(集計用!EK7,\"ー\"),集計用!EK7=0,集計用!EK7=\"\"),0,1)","v":0},{"$f":"IF(OR(EXACT(集計用!EL7,\"事業概要：\"),EXACT(集計用!EL7,\"ー\"),集計用!EL7=0,集計用!EL7=\"\"),0,1)","v":0},{"$f":"IF(OR(EXACT(集計用!EM7,\"事業概要：\"),EXACT(集計用!EM7,\"ー\"),集計用!EM7=0,集計用!EM7=\"\"),0,1)","v":0},{"$f":"IF(OR(EXACT(集計用!EN7,\"事業概要：\"),EXACT(集計用!EN7,\"ー\"),集計用!EN7=0,集計用!EN7=\"\"),0,1)","v":0},{"$f":"IF(OR(EXACT(集計用!EO7,\"事業概要：\"),EXACT(集計用!EO7,\"ー\"),集計用!EO7=0,集計用!EO7=\"\"),0,1)","v":0},{"$f":"IF(OR(EXACT(集計用!EP7,\"事業概要：\"),EXACT(集計用!EP7,\"ー\"),集計用!EP7=0,集計用!EP7=\"\"),0,1)","v":0},{"$f":"IF(OR(EXACT(集計用!EQ7,\"事業概要：\"),EXACT(集計用!EQ7,\"ー\"),集計用!EQ7=0,集計用!EQ7=\"\"),0,1)","v":0},{"$f":"IF(OR(EXACT(集計用!ER7,\"事業概要：\"),EXACT(集計用!ER7,\"ー\"),集計用!ER7=0,集計用!ER7=\"\"),0,1)","v":0},{"$f":"IF(OR(EXACT(集計用!ES7,\"事業概要：\"),EXACT(集計用!ES7,\"ー\"),集計用!ES7=0,集計用!ES7=\"\"),0,1)","v":0},{"$f":"IF(OR(EXACT(集計用!ET7,\"事業概要：\"),EXACT(集計用!ET7,\"ー\"),集計用!ET7=0,集計用!ET7=\"\"),0,1)","v":0},{"$f":"IF(OR(EXACT(集計用!EU7,\"事業概要：\"),EXACT(集計用!EU7,\"ー\"),集計用!EU7=0,集計用!EU7=\"\"),0,1)","v":0},{"$f":"IF(OR(EXACT(集計用!EV7,\"事業概要：\"),EXACT(集計用!EV7,\"ー\"),集計用!EV7=0,集計用!EV7=\"\"),0,1)","v":0},{"$f":"IF(OR(EXACT(集計用!EW7,\"事業概要：\"),EXACT(集計用!EW7,\"ー\"),集計用!EW7=0,集計用!EW7=\"\"),0,1)","v":0},{"$f":"IF(OR(EXACT(集計用!EX7,\"事業概要：\"),EXACT(集計用!EX7,\"ー\"),集計用!EX7=0,集計用!EX7=\"\"),0,1)","v":0},{"$f":"IF(OR(EXACT(集計用!EY7,\"事業概要：\"),EXACT(集計用!EY7,\"ー\"),集計用!EY7=0,集計用!EY7=\"\"),0,1)","v":0},{"$f":"IF(OR(EXACT(集計用!EZ7,\"事業概要：\"),EXACT(集計用!EZ7,\"ー\"),集計用!EZ7=0,集計用!EZ7=\"\"),0,1)","v":0},{"$f":"IF(OR(EXACT(集計用!FA7,\"事業概要：\"),EXACT(集計用!FA7,\"ー\"),集計用!FA7=0,集計用!FA7=\"\"),0,1)","v":0},{"$f":"IF(OR(EXACT(集計用!FB7,\"事業概要：\"),EXACT(集計用!FB7,\"ー\"),集計用!FB7=0,集計用!FB7=\"\"),0,1)","v":0},{"$f":"IF(OR(EXACT(集計用!FC7,\"事業概要：\"),EXACT(集計用!FC7,\"ー\"),集計用!FC7=0,集計用!FC7=\"\"),0,1)","v":0},{"$f":"IF(OR(EXACT(集計用!FD7,\"事業概要：\"),EXACT(集計用!FD7,\"ー\"),集計用!FD7=0,集計用!FD7=\"\"),0,1)","v":0},{"$f":"IF(OR(EXACT(集計用!FE7,\"事業概要：\"),EXACT(集計用!FE7,\"ー\"),集計用!FE7=0,集計用!FE7=\"\"),0,1)","v":0},{"$f":"IF(OR(EXACT(集計用!FF7,\"事業概要：\"),EXACT(集計用!FF7,\"ー\"),集計用!FF7=0,集計用!FF7=\"\"),0,1)","v":0},{"$f":"IF(OR(EXACT(集計用!FG7,\"事業概要：\"),EXACT(集計用!FG7,\"ー\"),集計用!FG7=0,集計用!FG7=\"\"),0,1)","v":0},{"$f":"IF(OR(EXACT(集計用!FH7,\"事業概要：\"),EXACT(集計用!FH7,\"ー\"),集計用!FH7=0,集計用!FH7=\"\"),0,1)","v":0},{"$f":"IF(OR(EXACT(集計用!FI7,\"事業概要：\"),EXACT(集計用!FI7,\"ー\"),集計用!FI7=0,集計用!FI7=\"\"),0,1)","v":0},{"$f":"IF(OR(EXACT(集計用!FJ7,\"事業概要：\"),EXACT(集計用!FJ7,\"ー\"),集計用!FJ7=0,集計用!FJ7=\"\"),0,1)","v":0},{"$f":"IF(OR(EXACT(集計用!FK7,\"事業概要：\"),EXACT(集計用!FK7,\"ー\"),集計用!FK7=0,集計用!FK7=\"\"),0,1)","v":0},{"$f":"IF(OR(EXACT(集計用!FL7,\"事業概要：\"),EXACT(集計用!FL7,\"ー\"),集計用!FL7=0,集計用!FL7=\"\"),0,1)","v":0},{"$f":"IF(OR(EXACT(集計用!FM7,\"事業概要：\"),EXACT(集計用!FM7,\"ー\"),集計用!FM7=0,集計用!FM7=\"\"),0,1)","v":0},{"$f":"IF(OR(EXACT(集計用!FN7,\"事業概要：\"),EXACT(集計用!FN7,\"ー\"),集計用!FN7=0,集計用!FN7=\"\"),0,1)","v":0},{"$f":"IF(OR(EXACT(集計用!FO7,\"事業概要：\"),EXACT(集計用!FO7,\"ー\"),集計用!FO7=0,集計用!FO7=\"\"),0,1)","v":0},{"$f":"IF(OR(EXACT(集計用!FP7,\"事業概要：\"),EXACT(集計用!FP7,\"ー\"),集計用!FP7=0,集計用!FP7=\"\"),0,1)","v":0},{"$f":"IF(OR(EXACT(集計用!FQ7,\"事業概要：\"),EXACT(集計用!FQ7,\"ー\"),集計用!FQ7=0,集計用!FQ7=\"\"),0,1)","v":0},{"$f":"IF(OR(EXACT(集計用!FR7,\"事業概要：\"),EXACT(集計用!FR7,\"ー\"),集計用!FR7=0,集計用!FR7=\"\"),0,1)","v":0},{"$f":"IF(OR(EXACT(集計用!FS7,\"事業概要：\"),EXACT(集計用!FS7,\"ー\"),集計用!FS7=0,集計用!FS7=\"\"),0,1)","v":0},{"$f":"IF(OR(EXACT(集計用!FT7,\"事業概要：\"),EXACT(集計用!FT7,\"ー\"),集計用!FT7=0,集計用!FT7=\"\"),0,1)","v":0},{"$f":"IF(OR(EXACT(集計用!FU7,\"事業概要：\"),EXACT(集計用!FU7,\"ー\"),集計用!FU7=0,集計用!FU7=\"\"),0,1)","v":0},{"$f":"IF(OR(EXACT(集計用!FV7,\"事業概要：\"),EXACT(集計用!FV7,\"ー\"),集計用!FV7=0,集計用!FV7=\"\"),0,1)","v":0},{"$f":"IF(OR(EXACT(集計用!FW7,\"事業概要：\"),EXACT(集計用!FW7,\"ー\"),集計用!FW7=0,集計用!FW7=\"\"),0,1)","v":0},{"$f":"IF(OR(EXACT(集計用!FX7,\"事業概要：\"),EXACT(集計用!FX7,\"ー\"),集計用!FX7=0,集計用!FX7=\"\"),0,1)","v":0},{"$f":"IF(OR(EXACT(集計用!FY7,\"事業概要：\"),EXACT(集計用!FY7,\"ー\"),集計用!FY7=0,集計用!FY7=\"\"),0,1)","v":0},{"$f":"IF(OR(EXACT(集計用!FZ7,\"事業概要：\"),EXACT(集計用!FZ7,\"ー\"),集計用!FZ7=0,集計用!FZ7=\"\"),0,1)","v":0},{"$f":"IF(OR(EXACT(集計用!GA7,\"事業概要：\"),EXACT(集計用!GA7,\"ー\"),集計用!GA7=0,集計用!GA7=\"\"),0,1)","v":0},{"$f":"IF(OR(EXACT(集計用!GB7,\"事業概要：\"),EXACT(集計用!GB7,\"ー\"),集計用!GB7=0,集計用!GB7=\"\"),0,1)","v":0},{"$f":"IF(OR(EXACT(集計用!GC7,\"事業概要：\"),EXACT(集計用!GC7,\"ー\"),集計用!GC7=0,集計用!GC7=\"\"),0,1)","v":0},{"$f":"IF(OR(EXACT(集計用!GD7,\"事業概要：\"),EXACT(集計用!GD7,\"ー\"),集計用!GD7=0,集計用!GD7=\"\"),0,1)","v":0},{"$f":"IF(OR(EXACT(集計用!GE7,\"事業概要：\"),EXACT(集計用!GE7,\"ー\"),集計用!GE7=0,集計用!GE7=\"\"),0,1)","v":0},{"$f":"IF(OR(EXACT(集計用!GF7,\"事業概要：\"),EXACT(集計用!GF7,\"ー\"),集計用!GF7=0,集計用!GF7=\"\"),0,1)","v":0},{"$f":"IF(OR(EXACT(集計用!GG7,\"事業概要：\"),EXACT(集計用!GG7,\"ー\"),集計用!GG7=0,集計用!GG7=\"\"),0,1)","v":0},{"$f":"IF(OR(EXACT(集計用!GH7,\"事業概要：\"),EXACT(集計用!GH7,\"ー\"),集計用!GH7=0,集計用!GH7=\"\"),0,1)","v":0},{"$f":"IF(OR(EXACT(集計用!GI7,\"事業概要：\"),EXACT(集計用!GI7,\"ー\"),集計用!GI7=0,集計用!GI7=\"\"),0,1)","v":0},{"$f":"IF(OR(EXACT(集計用!GJ7,\"事業概要：\"),EXACT(集計用!GJ7,\"ー\"),集計用!GJ7=0,集計用!GJ7=\"\"),0,1)","v":0},{"$f":"IF(OR(EXACT(集計用!GK7,\"事業概要：\"),EXACT(集計用!GK7,\"ー\"),集計用!GK7=0,集計用!GK7=\"\"),0,1)","v":0},{"$f":"IF(OR(EXACT(集計用!GL7,\"事業概要：\"),EXACT(集計用!GL7,\"ー\"),集計用!GL7=0,集計用!GL7=\"\"),0,1)","v":0},{"$f":"IF(OR(EXACT(集計用!GM7,\"事業概要：\"),EXACT(集計用!GM7,\"ー\"),集計用!GM7=0,集計用!GM7=\"\"),0,1)","v":0},{"$f":"IF(OR(EXACT(集計用!GN7,\"事業概要：\"),EXACT(集計用!GN7,\"ー\"),集計用!GN7=0,集計用!GN7=\"\"),0,1)","v":0},{"$f":"IF(OR(EXACT(集計用!GO7,\"事業概要：\"),EXACT(集計用!GO7,\"ー\"),集計用!GO7=0,集計用!GO7=\"\"),0,1)","v":0},{"$f":"IF(OR(EXACT(集計用!GP7,\"事業概要：\"),EXACT(集計用!GP7,\"ー\"),集計用!GP7=0,集計用!GP7=\"\"),0,1)","v":0},{"$f":"IF(OR(EXACT(集計用!GQ7,\"事業概要：\"),EXACT(集計用!GQ7,\"ー\"),集計用!GQ7=0,集計用!GQ7=\"\"),0,1)","v":0},{"$f":"IF(OR(EXACT(集計用!GR7,\"事業概要：\"),EXACT(集計用!GR7,\"ー\"),集計用!GR7=0,集計用!GR7=\"\"),0,1)","v":0},{"$f":"IF(OR(EXACT(集計用!GS7,\"事業概要：\"),EXACT(集計用!GS7,\"ー\"),集計用!GS7=0,集計用!GS7=\"\"),0,1)","v":0},{"$f":"IF(OR(EXACT(集計用!GT7,\"事業概要：\"),EXACT(集計用!GT7,\"ー\"),集計用!GT7=0,集計用!GT7=\"\"),0,1)","v":0},{"$f":"IF(OR(EXACT(集計用!GU7,\"事業概要：\"),EXACT(集計用!GU7,\"ー\"),集計用!GU7=0,集計用!GU7=\"\"),0,1)","v":0},{"$f":"IF(OR(EXACT(集計用!GV7,\"事業概要：\"),EXACT(集計用!GV7,\"ー\"),集計用!GV7=0,集計用!GV7=\"\"),0,1)","v":0},{"$f":"IF(OR(EXACT(集計用!GW7,\"事業概要：\"),EXACT(集計用!GW7,\"ー\"),集計用!GW7=0,集計用!GW7=\"\"),0,1)","v":0},{"$f":"IF(OR(EXACT(集計用!GX7,\"事業概要：\"),EXACT(集計用!GX7,\"ー\"),集計用!GX7=0,集計用!GX7=\"\"),0,1)","v":0},{"$f":"IF(OR(EXACT(集計用!GY7,\"事業概要：\"),EXACT(集計用!GY7,\"ー\"),集計用!GY7=0,集計用!GY7=\"\"),0,1)","v":0},{"$f":"IF(OR(EXACT(集計用!GZ7,\"事業概要：\"),EXACT(集計用!GZ7,\"ー\"),集計用!GZ7=0,集計用!GZ7=\"\"),0,1)","v":0},{"$f":"IF(OR(EXACT(集計用!HA7,\"事業概要：\"),EXACT(集計用!HA7,\"ー\"),集計用!HA7=0,集計用!HA7=\"\"),0,1)","v":0},{"$f":"IF(OR(EXACT(集計用!HB7,\"事業概要：\"),EXACT(集計用!HB7,\"ー\"),集計用!HB7=0,集計用!HB7=\"\"),0,1)","v":0},{"$f":"IF(OR(EXACT(集計用!HC7,\"事業概要：\"),EXACT(集計用!HC7,\"ー\"),集計用!HC7=0,集計用!HC7=\"\"),0,1)","v":0},{"$f":"IF(OR(EXACT(集計用!HD7,\"事業概要：\"),EXACT(集計用!HD7,\"ー\"),集計用!HD7=0,集計用!HD7=\"\"),0,1)","v":0},{"$f":"IF(OR(EXACT(集計用!HE7,\"事業概要：\"),EXACT(集計用!HE7,\"ー\"),集計用!HE7=0,集計用!HE7=\"\"),0,1)","v":0},{"$f":"IF(OR(EXACT(集計用!HF7,\"事業概要：\"),EXACT(集計用!HF7,\"ー\"),集計用!HF7=0,集計用!HF7=\"\"),0,1)","v":0},{"$f":"IF(OR(EXACT(集計用!HG7,\"事業概要：\"),EXACT(集計用!HG7,\"ー\"),集計用!HG7=0,集計用!HG7=\"\"),0,1)","v":0},{"$f":"IF(OR(EXACT(集計用!HH7,\"事業概要：\"),EXACT(集計用!HH7,\"ー\"),集計用!HH7=0,集計用!HH7=\"\"),0,1)","v":0},{"$f":"IF(OR(EXACT(集計用!HI7,\"事業概要：\"),EXACT(集計用!HI7,\"ー\"),集計用!HI7=0,集計用!HI7=\"\"),0,1)","v":0},{"$f":"IF(OR(EXACT(集計用!HJ7,\"事業概要：\"),EXACT(集計用!HJ7,\"ー\"),集計用!HJ7=0,集計用!HJ7=\"\"),0,1)","v":0},{"$f":"IF(OR(EXACT(集計用!HK7,\"事業概要：\"),EXACT(集計用!HK7,\"ー\"),集計用!HK7=0,集計用!HK7=\"\"),0,1)","v":0},{"$f":"IF(OR(EXACT(集計用!HL7,\"事業概要：\"),EXACT(集計用!HL7,\"ー\"),集計用!HL7=0,集計用!HL7=\"\"),0,1)","v":0},{"$f":"IF(OR(EXACT(集計用!HM7,\"事業概要：\"),EXACT(集計用!HM7,\"ー\"),集計用!HM7=0,集計用!HM7=\"\"),0,1)","v":0},{"$f":"IF(OR(EXACT(集計用!HN7,\"事業概要：\"),EXACT(集計用!HN7,\"ー\"),集計用!HN7=0,集計用!HN7=\"\"),0,1)","v":0},{"$f":"IF(OR(EXACT(集計用!HO7,\"事業概要：\"),EXACT(集計用!HO7,\"ー\"),集計用!HO7=0,集計用!HO7=\"\"),0,1)","v":0},{"$f":"IF(OR(EXACT(集計用!HP7,\"事業概要：\"),EXACT(集計用!HP7,\"ー\"),集計用!HP7=0,集計用!HP7=\"\"),0,1)","v":0},{"$f":"IF(OR(EXACT(集計用!HQ7,\"事業概要：\"),EXACT(集計用!HQ7,\"ー\"),集計用!HQ7=0,集計用!HQ7=\"\"),0,1)","v":0},{"$f":"IF(OR(EXACT(集計用!HR7,\"事業概要：\"),EXACT(集計用!HR7,\"ー\"),集計用!HR7=0,集計用!HR7=\"\"),0,1)","v":0},{"$f":"IF(OR(EXACT(集計用!HS7,\"事業概要：\"),EXACT(集計用!HS7,\"ー\"),集計用!HS7=0,集計用!HS7=\"\"),0,1)","v":0},{"$f":"IF(OR(EXACT(集計用!HT7,\"事業概要：\"),EXACT(集計用!HT7,\"ー\"),集計用!HT7=0,集計用!HT7=\"\"),0,1)","v":0},{"$f":"IF(OR(EXACT(集計用!HU7,\"事業概要：\"),EXACT(集計用!HU7,\"ー\"),集計用!HU7=0,集計用!HU7=\"\"),0,1)","v":0},{"$f":"IF(OR(EXACT(集計用!HV7,\"事業概要：\"),EXACT(集計用!HV7,\"ー\"),集計用!HV7=0,集計用!HV7=\"\"),0,1)","v":0},{"$f":"IF(OR(EXACT(集計用!HW7,\"事業概要：\"),EXACT(集計用!HW7,\"ー\"),集計用!HW7=0,集計用!HW7=\"\"),0,1)","v":0},{"$f":"IF(OR(EXACT(集計用!HX7,\"事業概要：\"),EXACT(集計用!HX7,\"ー\"),集計用!HX7=0,集計用!HX7=\"\"),0,1)","v":0},{"$f":"IF(OR(EXACT(集計用!HY7,\"事業概要：\"),EXACT(集計用!HY7,\"ー\"),集計用!HY7=0,集計用!HY7=\"\"),0,1)","v":0},{"$f":"IF(OR(EXACT(集計用!HZ7,\"事業概要：\"),EXACT(集計用!HZ7,\"ー\"),集計用!HZ7=0,集計用!HZ7=\"\"),0,1)","v":0},{"$f":"IF(OR(EXACT(集計用!IA7,\"事業概要：\"),EXACT(集計用!IA7,\"ー\"),集計用!IA7=0,集計用!IA7=\"\"),0,1)","v":0},{"$f":"IF(OR(EXACT(集計用!IB7,\"事業概要：\"),EXACT(集計用!IB7,\"ー\"),集計用!IB7=0,集計用!IB7=\"\"),0,1)","v":0},{"$f":"IF(OR(EXACT(集計用!IC7,\"事業概要：\"),EXACT(集計用!IC7,\"ー\"),集計用!IC7=0,集計用!IC7=\"\"),0,1)","v":0},{"$f":"IF(OR(EXACT(集計用!ID7,\"事業概要：\"),EXACT(集計用!ID7,\"ー\"),集計用!ID7=0,集計用!ID7=\"\"),0,1)","v":0},{"$f":"IF(OR(EXACT(集計用!IE7,\"事業概要：\"),EXACT(集計用!IE7,\"ー\"),集計用!IE7=0,集計用!IE7=\"\"),0,1)","v":0},{"$f":"IF(OR(EXACT(集計用!IF7,\"事業概要：\"),EXACT(集計用!IF7,\"ー\"),集計用!IF7=0,集計用!IF7=\"\"),0,1)","v":0},{"$f":"IF(OR(EXACT(集計用!IG7,\"事業概要：\"),EXACT(集計用!IG7,\"ー\"),集計用!IG7=0,集計用!IG7=\"\"),0,1)","v":0},{"$f":"IF(OR(EXACT(集計用!IH7,\"事業概要：\"),EXACT(集計用!IH7,\"ー\"),集計用!IH7=0,集計用!IH7=\"\"),0,1)","v":0},{"$f":"IF(OR(EXACT(集計用!II7,\"事業概要：\"),EXACT(集計用!II7,\"ー\"),集計用!II7=0,集計用!II7=\"\"),0,1)","v":0},{"$f":"IF(OR(EXACT(集計用!IJ7,\"事業概要：\"),EXACT(集計用!IJ7,\"ー\"),集計用!IJ7=0,集計用!IJ7=\"\"),0,1)","v":0},{"$f":"IF(OR(EXACT(集計用!IK7,\"事業概要：\"),EXACT(集計用!IK7,\"ー\"),集計用!IK7=0,集計用!IK7=\"\"),0,1)","v":0},{"$f":"IF(OR(EXACT(集計用!IL7,\"事業概要：\"),EXACT(集計用!IL7,\"ー\"),集計用!IL7=0,集計用!IL7=\"\"),0,1)","v":0},{"$f":"IF(OR(EXACT(集計用!IM7,\"事業概要：\"),EXACT(集計用!IM7,\"ー\"),集計用!IM7=0,集計用!IM7=\"\"),0,1)","v":0},{"$f":"IF(OR(EXACT(集計用!IN7,\"事業概要：\"),EXACT(集計用!IN7,\"ー\"),集計用!IN7=0,集計用!IN7=\"\"),0,1)","v":0},{"$f":"IF(OR(EXACT(集計用!IO7,\"事業概要：\"),EXACT(集計用!IO7,\"ー\"),集計用!IO7=0,集計用!IO7=\"\"),0,1)","v":0},{"$f":"IF(OR(EXACT(集計用!IP7,\"事業概要：\"),EXACT(集計用!IP7,\"ー\"),集計用!IP7=0,集計用!IP7=\"\"),0,1)","v":0},{"$f":"IF(OR(EXACT(集計用!IQ7,\"事業概要：\"),EXACT(集計用!IQ7,\"ー\"),集計用!IQ7=0,集計用!IQ7=\"\"),0,1)","v":0},{"$f":"IF(OR(EXACT(集計用!IR7,\"事業概要：\"),EXACT(集計用!IR7,\"ー\"),集計用!IR7=0,集計用!IR7=\"\"),0,1)","v":0},{"$f":"IF(OR(EXACT(集計用!IS7,\"事業概要：\"),EXACT(集計用!IS7,\"ー\"),集計用!IS7=0,集計用!IS7=\"\"),0,1)","v":0},{"$f":"IF(OR(EXACT(集計用!IT7,\"事業概要：\"),EXACT(集計用!IT7,\"ー\"),集計用!IT7=0,集計用!IT7=\"\"),0,1)","v":0},{"$f":"IF(OR(EXACT(集計用!IU7,\"事業概要：\"),EXACT(集計用!IU7,\"ー\"),集計用!IU7=0,集計用!IU7=\"\"),0,1)","v":0},{"$f":"IF(OR(EXACT(集計用!IV7,\"事業概要：\"),EXACT(集計用!IV7,\"ー\"),集計用!IV7=0,集計用!IV7=\"\"),0,1)","v":0},{"$f":"IF(OR(EXACT(集計用!IW7,\"事業概要：\"),EXACT(集計用!IW7,\"ー\"),集計用!IW7=0,集計用!IW7=\"\"),0,1)","v":0},{"$f":"IF(OR(EXACT(集計用!IX7,\"事業概要：\"),EXACT(集計用!IX7,\"ー\"),集計用!IX7=0,集計用!IX7=\"\"),0,1)","v":0},{"$f":"IF(OR(EXACT(集計用!IY7,\"事業概要：\"),EXACT(集計用!IY7,\"ー\"),集計用!IY7=0,集計用!IY7=\"\"),0,1)","v":0},{"$f":"IF(OR(EXACT(集計用!IZ7,\"事業概要：\"),EXACT(集計用!IZ7,\"ー\"),集計用!IZ7=0,集計用!IZ7=\"\"),0,1)","v":0},{"$f":"IF(OR(EXACT(集計用!JA7,\"事業概要：\"),EXACT(集計用!JA7,\"ー\"),集計用!JA7=0,集計用!JA7=\"\"),0,1)","v":0},{"$f":"IF(OR(EXACT(集計用!JB7,\"事業概要：\"),EXACT(集計用!JB7,\"ー\"),集計用!JB7=0,集計用!JB7=\"\"),0,1)","v":0},{"$f":"IF(OR(EXACT(集計用!JC7,\"事業概要：\"),EXACT(集計用!JC7,\"ー\"),集計用!JC7=0,集計用!JC7=\"\"),0,1)","v":0},{"$f":"IF(OR(EXACT(集計用!JD7,\"事業概要：\"),EXACT(集計用!JD7,\"ー\"),集計用!JD7=0,集計用!JD7=\"\"),0,1)","v":0},{"$f":"IF(OR(EXACT(集計用!JE7,\"事業概要：\"),EXACT(集計用!JE7,\"ー\"),集計用!JE7=0,集計用!JE7=\"\"),0,1)","v":0},{"$f":"IF(OR(EXACT(集計用!JF7,\"事業概要：\"),EXACT(集計用!JF7,\"ー\"),集計用!JF7=0,集計用!JF7=\"\"),0,1)","v":0},{"$f":"IF(OR(EXACT(集計用!JG7,\"事業概要：\"),EXACT(集計用!JG7,\"ー\"),集計用!JG7=0,集計用!JG7=\"\"),0,1)","v":0},{"$f":"IF(OR(EXACT(集計用!JH7,\"事業概要：\"),EXACT(集計用!JH7,\"ー\"),集計用!JH7=0,集計用!JH7=\"\"),0,1)","v":0},{"$f":"IF(OR(EXACT(集計用!JI7,\"事業概要：\"),EXACT(集計用!JI7,\"ー\"),集計用!JI7=0,集計用!JI7=\"\"),0,1)","v":0},{"$f":"IF(OR(EXACT(集計用!JJ7,\"事業概要：\"),EXACT(集計用!JJ7,\"ー\"),集計用!JJ7=0,集計用!JJ7=\"\"),0,1)","v":0},{"$f":"IF(OR(EXACT(集計用!JK7,\"事業概要：\"),EXACT(集計用!JK7,\"ー\"),集計用!JK7=0,集計用!JK7=\"\"),0,1)","v":0},{"$f":"IF(OR(EXACT(集計用!JL7,\"事業概要：\"),EXACT(集計用!JL7,\"ー\"),集計用!JL7=0,集計用!JL7=\"\"),0,1)","v":0},{"$f":"IF(OR(EXACT(集計用!JM7,\"事業概要：\"),EXACT(集計用!JM7,\"ー\"),集計用!JM7=0,集計用!JM7=\"\"),0,1)","v":0},{"$f":"IF(OR(EXACT(集計用!JN7,\"事業概要：\"),EXACT(集計用!JN7,\"ー\"),集計用!JN7=0,集計用!JN7=\"\"),0,1)","v":0},{"$f":"IF(OR(EXACT(集計用!JO7,\"事業概要：\"),EXACT(集計用!JO7,\"ー\"),集計用!JO7=0,集計用!JO7=\"\"),0,1)","v":0},{"$f":"IF(OR(EXACT(集計用!JP7,\"事業概要：\"),EXACT(集計用!JP7,\"ー\"),集計用!JP7=0,集計用!JP7=\"\"),0,1)","v":0},{"$f":"IF(OR(EXACT(集計用!JQ7,\"事業概要：\"),EXACT(集計用!JQ7,\"ー\"),集計用!JQ7=0,集計用!JQ7=\"\"),0,1)","v":0},{"$f":"IF(OR(EXACT(集計用!JR7,\"事業概要：\"),EXACT(集計用!JR7,\"ー\"),集計用!JR7=0,集計用!JR7=\"\"),0,1)","v":0},{"$f":"IF(OR(EXACT(集計用!JS7,\"事業概要：\"),EXACT(集計用!JS7,\"ー\"),集計用!JS7=0,集計用!JS7=\"\"),0,1)","v":0},{"$f":"IF(OR(EXACT(集計用!JT7,\"事業概要：\"),EXACT(集計用!JT7,\"ー\"),集計用!JT7=0,集計用!JT7=\"\"),0,1)","v":0},{"$f":"IF(OR(EXACT(集計用!JU7,\"事業概要：\"),EXACT(集計用!JU7,\"ー\"),集計用!JU7=0,集計用!JU7=\"\"),0,1)","v":0},{"$f":"IF(OR(EXACT(集計用!JV7,\"事業概要：\"),EXACT(集計用!JV7,\"ー\"),集計用!JV7=0,集計用!JV7=\"\"),0,1)","v":0},{"$f":"IF(OR(EXACT(集計用!JW7,\"事業概要：\"),EXACT(集計用!JW7,\"ー\"),集計用!JW7=0,集計用!JW7=\"\"),0,1)","v":0},{"$f":"IF(OR(EXACT(集計用!JX7,\"事業概要：\"),EXACT(集計用!JX7,\"ー\"),集計用!JX7=0,集計用!JX7=\"\"),0,1)","v":0},{"$f":"IF(OR(EXACT(集計用!JY7,\"事業概要：\"),EXACT(集計用!JY7,\"ー\"),集計用!JY7=0,集計用!JY7=\"\"),0,1)","v":0},{"$f":"IF(OR(EXACT(集計用!JZ7,\"事業概要：\"),EXACT(集計用!JZ7,\"ー\"),集計用!JZ7=0,集計用!JZ7=\"\"),0,1)","v":0},{"$f":"IF(OR(EXACT(集計用!KA7,\"事業概要：\"),EXACT(集計用!KA7,\"ー\"),集計用!KA7=0,集計用!KA7=\"\"),0,1)","v":0},{"$f":"IF(OR(EXACT(集計用!KB7,\"事業概要：\"),EXACT(集計用!KB7,\"ー\"),集計用!KB7=0,集計用!KB7=\"\"),0,1)","v":0},{"$f":"IF(OR(EXACT(集計用!KC7,\"事業概要：\"),EXACT(集計用!KC7,\"ー\"),集計用!KC7=0,集計用!KC7=\"\"),0,1)","v":0},{"$f":"IF(OR(EXACT(集計用!KD7,\"事業概要：\"),EXACT(集計用!KD7,\"ー\"),集計用!KD7=0,集計用!KD7=\"\"),0,1)","v":0},{"$f":"IF(OR(EXACT(集計用!KE7,\"事業概要：\"),EXACT(集計用!KE7,\"ー\"),集計用!KE7=0,集計用!KE7=\"\"),0,1)","v":0},{"$f":"IF(OR(EXACT(集計用!KF7,\"事業概要：\"),EXACT(集計用!KF7,\"ー\"),集計用!KF7=0,集計用!KF7=\"\"),0,1)","v":0},{"$f":"IF(OR(EXACT(集計用!KG7,\"事業概要：\"),EXACT(集計用!KG7,\"ー\"),集計用!KG7=0,集計用!KG7=\"\"),0,1)","v":0},{"$f":"IF(OR(EXACT(集計用!KH7,\"事業概要：\"),EXACT(集計用!KH7,\"ー\"),集計用!KH7=0,集計用!KH7=\"\"),0,1)","v":0},{"$f":"IF(OR(EXACT(集計用!KI7,\"事業概要：\"),EXACT(集計用!KI7,\"ー\"),集計用!KI7=0,集計用!KI7=\"\"),0,1)","v":0},{"$f":"IF(OR(EXACT(集計用!KJ7,\"事業概要：\"),EXACT(集計用!KJ7,\"ー\"),集計用!KJ7=0,集計用!KJ7=\"\"),0,1)","v":0},{"$f":"IF(OR(EXACT(集計用!KK7,\"事業概要：\"),EXACT(集計用!KK7,\"ー\"),集計用!KK7=0,集計用!KK7=\"\"),0,1)","v":0},{"$f":"IF(OR(EXACT(集計用!KL7,\"事業概要：\"),EXACT(集計用!KL7,\"ー\"),集計用!KL7=0,集計用!KL7=\"\"),0,1)","v":0},{"$f":"IF(OR(EXACT(集計用!KM7,\"事業概要：\"),EXACT(集計用!KM7,\"ー\"),集計用!KM7=0,集計用!KM7=\"\"),0,1)","v":0},{"$f":"IF(OR(EXACT(集計用!KN7,\"事業概要：\"),EXACT(集計用!KN7,\"ー\"),集計用!KN7=0,集計用!KN7=\"\"),0,1)","v":0},{"$f":"IF(OR(EXACT(集計用!KO7,\"事業概要：\"),EXACT(集計用!KO7,\"ー\"),集計用!KO7=0,集計用!KO7=\"\"),0,1)","v":0},{"$f":"IF(OR(EXACT(集計用!KP7,\"事業概要：\"),EXACT(集計用!KP7,\"ー\"),集計用!KP7=0,集計用!KP7=\"\"),0,1)","v":0},{"$f":"IF(OR(EXACT(集計用!KQ7,\"事業概要：\"),EXACT(集計用!KQ7,\"ー\"),集計用!KQ7=0,集計用!KQ7=\"\"),0,1)","v":0},{"$f":"IF(OR(EXACT(集計用!KR7,\"事業概要：\"),EXACT(集計用!KR7,\"ー\"),集計用!KR7=0,集計用!KR7=\"\"),0,1)","v":0},{"$f":"IF(OR(EXACT(集計用!KS7,\"事業概要：\"),EXACT(集計用!KS7,\"ー\"),集計用!KS7=0,集計用!KS7=\"\"),0,1)","v":0},{"$f":"IF(OR(EXACT(集計用!KT7,\"事業概要：\"),EXACT(集計用!KT7,\"ー\"),集計用!KT7=0,集計用!KT7=\"\"),0,1)","v":0},{"$f":"IF(OR(EXACT(集計用!KU7,\"事業概要：\"),EXACT(集計用!KU7,\"ー\"),集計用!KU7=0,集計用!KU7=\"\"),0,1)","v":0},{"$f":"IF(OR(EXACT(集計用!KV7,\"事業概要：\"),EXACT(集計用!KV7,\"ー\"),集計用!KV7=0,集計用!KV7=\"\"),0,1)","v":0},{"$f":"IF(OR(EXACT(集計用!KW7,\"事業概要：\"),EXACT(集計用!KW7,\"ー\"),集計用!KW7=0,集計用!KW7=\"\"),0,1)","v":0},{"$f":"IF(OR(EXACT(集計用!KX7,\"事業概要：\"),EXACT(集計用!KX7,\"ー\"),集計用!KX7=0,集計用!KX7=\"\"),0,1)","v":0},{"$f":"IF(OR(EXACT(集計用!KY7,\"事業概要：\"),EXACT(集計用!KY7,\"ー\"),集計用!KY7=0,集計用!KY7=\"\"),0,1)","v":0},{"$f":"IF(OR(EXACT(集計用!KZ7,\"事業概要：\"),EXACT(集計用!KZ7,\"ー\"),集計用!KZ7=0,集計用!KZ7=\"\"),0,1)","v":0},{"$f":"IF(OR(EXACT(集計用!LA7,\"事業概要：\"),EXACT(集計用!LA7,\"ー\"),集計用!LA7=0,集計用!LA7=\"\"),0,1)","v":0},{"$f":"IF(OR(EXACT(集計用!LB7,\"事業概要：\"),EXACT(集計用!LB7,\"ー\"),集計用!LB7=0,集計用!LB7=\"\"),0,1)","v":0},{"$f":"IF(OR(EXACT(集計用!LC7,\"事業概要：\"),EXACT(集計用!LC7,\"ー\"),集計用!LC7=0,集計用!LC7=\"\"),0,1)","v":0},{"$f":"IF(OR(EXACT(集計用!LD7,\"事業概要：\"),EXACT(集計用!LD7,\"ー\"),集計用!LD7=0,集計用!LD7=\"\"),0,1)","v":0},{"$f":"IF(OR(EXACT(集計用!LE7,\"事業概要：\"),EXACT(集計用!LE7,\"ー\"),集計用!LE7=0,集計用!LE7=\"\"),0,1)","v":0},{"$f":"IF(OR(EXACT(集計用!LF7,\"事業概要：\"),EXACT(集計用!LF7,\"ー\"),集計用!LF7=0,集計用!LF7=\"\"),0,1)","v":0},{"$f":"IF(OR(EXACT(集計用!LG7,\"事業概要：\"),EXACT(集計用!LG7,\"ー\"),集計用!LG7=0,集計用!LG7=\"\"),0,1)","v":0},{"$f":"IF(OR(EXACT(集計用!LH7,\"事業概要：\"),EXACT(集計用!LH7,\"ー\"),集計用!LH7=0,集計用!LH7=\"\"),0,1)","v":0},{"$f":"IF(OR(EXACT(集計用!LI7,\"事業概要：\"),EXACT(集計用!LI7,\"ー\"),集計用!LI7=0,集計用!LI7=\"\"),0,1)","v":0},{"$f":"IF(OR(EXACT(集計用!LJ7,\"事業概要：\"),EXACT(集計用!LJ7,\"ー\"),集計用!LJ7=0,集計用!LJ7=\"\"),0,1)","v":0},{"$f":"IF(OR(EXACT(集計用!LK7,\"事業概要：\"),EXACT(集計用!LK7,\"ー\"),集計用!LK7=0,集計用!LK7=\"\"),0,1)","v":0},{"$f":"IF(OR(EXACT(集計用!LL7,\"事業概要：\"),EXACT(集計用!LL7,\"ー\"),集計用!LL7=0,集計用!LL7=\"\"),0,1)","v":0},{"$f":"IF(OR(EXACT(集計用!LM7,\"事業概要：\"),EXACT(集計用!LM7,\"ー\"),集計用!LM7=0,集計用!LM7=\"\"),0,1)","v":0},{"$f":"IF(OR(EXACT(集計用!LN7,\"事業概要：\"),EXACT(集計用!LN7,\"ー\"),集計用!LN7=0,集計用!LN7=\"\"),0,1)","v":0},{"$f":"IF(OR(EXACT(集計用!LO7,\"事業概要：\"),EXACT(集計用!LO7,\"ー\"),集計用!LO7=0,集計用!LO7=\"\"),0,1)","v":0},{"$f":"IF(OR(EXACT(集計用!LP7,\"事業概要：\"),EXACT(集計用!LP7,\"ー\"),集計用!LP7=0,集計用!LP7=\"\"),0,1)","v":0},{"$f":"IF(OR(EXACT(集計用!LQ7,\"事業概要：\"),EXACT(集計用!LQ7,\"ー\"),集計用!LQ7=0,集計用!LQ7=\"\"),0,1)","v":0},{"$f":"IF(OR(EXACT(集計用!LR7,\"事業概要：\"),EXACT(集計用!LR7,\"ー\"),集計用!LR7=0,集計用!LR7=\"\"),0,1)","v":0},{"$f":"IF(OR(EXACT(集計用!LS7,\"事業概要：\"),EXACT(集計用!LS7,\"ー\"),集計用!LS7=0,集計用!LS7=\"\"),0,1)","v":0},{"$f":"IF(OR(EXACT(集計用!LT7,\"事業概要：\"),EXACT(集計用!LT7,\"ー\"),集計用!LT7=0,集計用!LT7=\"\"),0,1)","v":0},{"$f":"IF(OR(EXACT(集計用!LU7,\"事業概要：\"),EXACT(集計用!LU7,\"ー\"),集計用!LU7=0,集計用!LU7=\"\"),0,1)","v":0},{"$f":"IF(OR(EXACT(集計用!LV7,\"事業概要：\"),EXACT(集計用!LV7,\"ー\"),集計用!LV7=0,集計用!LV7=\"\"),0,1)","v":0},{"$f":"IF(OR(EXACT(集計用!LW7,\"事業概要：\"),EXACT(集計用!LW7,\"ー\"),集計用!LW7=0,集計用!LW7=\"\"),0,1)","v":0},{"$f":"IF(OR(EXACT(集計用!LX7,\"事業概要：\"),EXACT(集計用!LX7,\"ー\"),集計用!LX7=0,集計用!LX7=\"\"),0,1)","v":0},{"$f":"IF(OR(EXACT(集計用!LY7,\"事業概要：\"),EXACT(集計用!LY7,\"ー\"),集計用!LY7=0,集計用!LY7=\"\"),0,1)","v":0},{"$f":"IF(OR(EXACT(集計用!LZ7,\"事業概要：\"),EXACT(集計用!LZ7,\"ー\"),集計用!LZ7=0,集計用!LZ7=\"\"),0,1)","v":0},{"$f":"IF(OR(EXACT(集計用!MA7,\"事業概要：\"),EXACT(集計用!MA7,\"ー\"),集計用!MA7=0,集計用!MA7=\"\"),0,1)","v":0},{"$f":"IF(OR(EXACT(集計用!MB7,\"事業概要：\"),EXACT(集計用!MB7,\"ー\"),集計用!MB7=0,集計用!MB7=\"\"),0,1)","v":0},{"$f":"IF(OR(EXACT(集計用!MC7,\"事業概要：\"),EXACT(集計用!MC7,\"ー\"),集計用!MC7=0,集計用!MC7=\"\"),0,1)","v":0},{"$f":"IF(OR(EXACT(集計用!MD7,\"事業概要：\"),EXACT(集計用!MD7,\"ー\"),集計用!MD7=0,集計用!MD7=\"\"),0,1)","v":0},{"$f":"IF(OR(EXACT(集計用!ME7,\"事業概要：\"),EXACT(集計用!ME7,\"ー\"),集計用!ME7=0,集計用!ME7=\"\"),0,1)","v":0},{"$f":"IF(OR(EXACT(集計用!MF7,\"事業概要：\"),EXACT(集計用!MF7,\"ー\"),集計用!MF7=0,集計用!MF7=\"\"),0,1)","v":0},{"$f":"IF(OR(EXACT(集計用!MG7,\"事業概要：\"),EXACT(集計用!MG7,\"ー\"),集計用!MG7=0,集計用!MG7=\"\"),0,1)","v":0},{"$f":"IF(OR(EXACT(集計用!MH7,\"事業概要：\"),EXACT(集計用!MH7,\"ー\"),集計用!MH7=0,集計用!MH7=\"\"),0,1)","v":0},{"$f":"IF(OR(EXACT(集計用!MI7,\"事業概要：\"),EXACT(集計用!MI7,\"ー\"),集計用!MI7=0,集計用!MI7=\"\"),0,1)","v":0},{"$f":"IF(OR(EXACT(集計用!MJ7,\"事業概要：\"),EXACT(集計用!MJ7,\"ー\"),集計用!MJ7=0,集計用!MJ7=\"\"),0,1)","v":0},{"$f":"IF(OR(EXACT(集計用!MK7,\"事業概要：\"),EXACT(集計用!MK7,\"ー\"),集計用!MK7=0,集計用!MK7=\"\"),0,1)","v":0},{"$f":"IF(OR(EXACT(集計用!ML7,\"事業概要：\"),EXACT(集計用!ML7,\"ー\"),集計用!ML7=0,集計用!ML7=\"\"),0,1)","v":0},{"$f":"IF(OR(EXACT(集計用!MM7,\"事業概要：\"),EXACT(集計用!MM7,\"ー\"),集計用!MM7=0,集計用!MM7=\"\"),0,1)","v":0},{"$f":"IF(OR(EXACT(集計用!MN7,\"事業概要：\"),EXACT(集計用!MN7,\"ー\"),集計用!MN7=0,集計用!MN7=\"\"),0,1)","v":0},{"$f":"IF(OR(EXACT(集計用!MO7,\"事業概要：\"),EXACT(集計用!MO7,\"ー\"),集計用!MO7=0,集計用!MO7=\"\"),0,1)","v":0},{"$f":"IF(OR(EXACT(集計用!MP7,\"事業概要：\"),EXACT(集計用!MP7,\"ー\"),集計用!MP7=0,集計用!MP7=\"\"),0,1)","v":0},{"$f":"IF(OR(EXACT(集計用!MQ7,\"事業概要：\"),EXACT(集計用!MQ7,\"ー\"),集計用!MQ7=0,集計用!MQ7=\"\"),0,1)","v":0},{"$f":"IF(OR(EXACT(集計用!MR7,\"事業概要：\"),EXACT(集計用!MR7,\"ー\"),集計用!MR7=0,集計用!MR7=\"\"),0,1)","v":0},{"$f":"IF(OR(EXACT(集計用!MS7,\"事業概要：\"),EXACT(集計用!MS7,\"ー\"),集計用!MS7=0,集計用!MS7=\"\"),0,1)","v":0},{"$f":"IF(OR(EXACT(集計用!MT7,\"事業概要：\"),EXACT(集計用!MT7,\"ー\"),集計用!MT7=0,集計用!MT7=\"\"),0,1)","v":0},{"$f":"IF(OR(EXACT(集計用!MU7,\"事業概要：\"),EXACT(集計用!MU7,\"ー\"),集計用!MU7=0,集計用!MU7=\"\"),0,1)","v":0},{"$f":"IF(OR(EXACT(集計用!MV7,\"事業概要：\"),EXACT(集計用!MV7,\"ー\"),集計用!MV7=0,集計用!MV7=\"\"),0,1)","v":0},{"$f":"IF(OR(EXACT(集計用!MW7,\"事業概要：\"),EXACT(集計用!MW7,\"ー\"),集計用!MW7=0,集計用!MW7=\"\"),0,1)","v":0},{"$f":"IF(OR(EXACT(集計用!MX7,\"事業概要：\"),EXACT(集計用!MX7,\"ー\"),集計用!MX7=0,集計用!MX7=\"\"),0,1)","v":0},{"$f":"IF(OR(EXACT(集計用!MY7,\"事業概要：\"),EXACT(集計用!MY7,\"ー\"),集計用!MY7=0,集計用!MY7=\"\"),0,1)","v":0},{"$f":"IF(OR(EXACT(集計用!MZ7,\"事業概要：\"),EXACT(集計用!MZ7,\"ー\"),集計用!MZ7=0,集計用!MZ7=\"\"),0,1)","v":0},{"$f":"IF(OR(EXACT(集計用!NA7,\"事業概要：\"),EXACT(集計用!NA7,\"ー\"),集計用!NA7=0,集計用!NA7=\"\"),0,1)","v":0},{"$f":"IF(OR(EXACT(集計用!NB7,\"事業概要：\"),EXACT(集計用!NB7,\"ー\"),集計用!NB7=0,集計用!NB7=\"\"),0,1)","v":0},{"$f":"IF(OR(EXACT(集計用!NC7,\"事業概要：\"),EXACT(集計用!NC7,\"ー\"),集計用!NC7=0,集計用!NC7=\"\"),0,1)","v":0},{"$f":"IF(OR(EXACT(集計用!ND7,\"事業概要：\"),EXACT(集計用!ND7,\"ー\"),集計用!ND7=0,集計用!ND7=\"\"),0,1)","v":0},{"$f":"IF(OR(EXACT(集計用!NE7,\"事業概要：\"),EXACT(集計用!NE7,\"ー\"),集計用!NE7=0,集計用!NE7=\"\"),0,1)","v":0},{"$f":"IF(OR(EXACT(集計用!NF7,\"事業概要：\"),EXACT(集計用!NF7,\"ー\"),集計用!NF7=0,集計用!NF7=\"\"),0,1)","v":0},{"$f":"IF(OR(EXACT(集計用!NG7,\"事業概要：\"),EXACT(集計用!NG7,\"ー\"),集計用!NG7=0,集計用!NG7=\"\"),0,1)","v":0},{"$f":"IF(OR(EXACT(集計用!NH7,\"事業概要：\"),EXACT(集計用!NH7,\"ー\"),集計用!NH7=0,集計用!NH7=\"\"),0,1)","v":0},{"$f":"IF(OR(EXACT(集計用!NI7,\"事業概要：\"),EXACT(集計用!NI7,\"ー\"),集計用!NI7=0,集計用!NI7=\"\"),0,1)","v":0},{"$f":"IF(OR(EXACT(集計用!NJ7,\"事業概要：\"),EXACT(集計用!NJ7,\"ー\"),集計用!NJ7=0,集計用!NJ7=\"\"),0,1)","v":0},{"$f":"IF(OR(EXACT(集計用!NK7,\"事業概要：\"),EXACT(集計用!NK7,\"ー\"),集計用!NK7=0,集計用!NK7=\"\"),0,1)","v":0},{"$f":"IF(OR(EXACT(集計用!NL7,\"事業概要：\"),EXACT(集計用!NL7,\"ー\"),集計用!NL7=0,集計用!NL7=\"\"),0,1)","v":0},{"$f":"IF(OR(EXACT(集計用!NM7,\"事業概要：\"),EXACT(集計用!NM7,\"ー\"),集計用!NM7=0,集計用!NM7=\"\"),0,1)","v":0},{"$f":"IF(OR(EXACT(集計用!NN7,\"事業概要：\"),EXACT(集計用!NN7,\"ー\"),集計用!NN7=0,集計用!NN7=\"\"),0,1)","v":0},{"$f":"IF(OR(EXACT(集計用!NO7,\"事業概要：\"),EXACT(集計用!NO7,\"ー\"),集計用!NO7=0,集計用!NO7=\"\"),0,1)","v":0},{"$f":"IF(OR(EXACT(集計用!NP7,\"事業概要：\"),EXACT(集計用!NP7,\"ー\"),集計用!NP7=0,集計用!NP7=\"\"),0,1)","v":0},{"$f":"IF(OR(EXACT(集計用!NQ7,\"事業概要：\"),EXACT(集計用!NQ7,\"ー\"),集計用!NQ7=0,集計用!NQ7=\"\"),0,1)","v":0},{"$f":"IF(OR(EXACT(集計用!NR7,\"事業概要：\"),EXACT(集計用!NR7,\"ー\"),集計用!NR7=0,集計用!NR7=\"\"),0,1)","v":0},{"$f":"IF(OR(EXACT(集計用!NS7,\"事業概要：\"),EXACT(集計用!NS7,\"ー\"),集計用!NS7=0,集計用!NS7=\"\"),0,1)","v":0},{"$f":"IF(OR(EXACT(集計用!NT7,\"事業概要：\"),EXACT(集計用!NT7,\"ー\"),集計用!NT7=0,集計用!NT7=\"\"),0,1)","v":0},{"$f":"IF(OR(EXACT(集計用!NU7,\"事業概要：\"),EXACT(集計用!NU7,\"ー\"),集計用!NU7=0,集計用!NU7=\"\"),0,1)","v":0},{"$f":"IF(OR(EXACT(集計用!NV7,\"事業概要：\"),EXACT(集計用!NV7,\"ー\"),集計用!NV7=0,集計用!NV7=\"\"),0,1)","v":0},{"$f":"IF(OR(EXACT(集計用!NW7,\"事業概要：\"),EXACT(集計用!NW7,\"ー\"),集計用!NW7=0,集計用!NW7=\"\"),0,1)","v":0},{"$f":"IF(OR(EXACT(集計用!NX7,\"事業概要：\"),EXACT(集計用!NX7,\"ー\"),集計用!NX7=0,集計用!NX7=\"\"),0,1)","v":0},{"$f":"IF(OR(EXACT(集計用!NY7,\"事業概要：\"),EXACT(集計用!NY7,\"ー\"),集計用!NY7=0,集計用!NY7=\"\"),0,1)","v":0},{"$f":"IF(OR(EXACT(集計用!NZ7,\"事業概要：\"),EXACT(集計用!NZ7,\"ー\"),集計用!NZ7=0,集計用!NZ7=\"\"),0,1)","v":0},{"$f":"IF(OR(EXACT(集計用!OA7,\"事業概要：\"),EXACT(集計用!OA7,\"ー\"),集計用!OA7=0,集計用!OA7=\"\"),0,1)","v":0},{"$f":"IF(OR(EXACT(集計用!OB7,\"事業概要：\"),EXACT(集計用!OB7,\"ー\"),集計用!OB7=0,集計用!OB7=\"\"),0,1)","v":0},{"$f":"IF(OR(EXACT(集計用!OC7,\"事業概要：\"),EXACT(集計用!OC7,\"ー\"),集計用!OC7=0,集計用!OC7=\"\"),0,1)","v":0},{"$f":"IF(OR(EXACT(集計用!OD7,\"事業概要：\"),EXACT(集計用!OD7,\"ー\"),集計用!OD7=0,集計用!OD7=\"\"),0,1)","v":0},{"$f":"IF(OR(EXACT(集計用!OE7,\"事業概要：\"),EXACT(集計用!OE7,\"ー\"),集計用!OE7=0,集計用!OE7=\"\"),0,1)","v":0},{"$f":"IF(OR(EXACT(集計用!OF7,\"事業概要：\"),EXACT(集計用!OF7,\"ー\"),集計用!OF7=0,集計用!OF7=\"\"),0,1)","v":0},{"$f":"IF(OR(EXACT(集計用!OG7,\"事業概要：\"),EXACT(集計用!OG7,\"ー\"),集計用!OG7=0,集計用!OG7=\"\"),0,1)","v":0},{"$f":"IF(OR(EXACT(集計用!OH7,\"事業概要：\"),EXACT(集計用!OH7,\"ー\"),集計用!OH7=0,集計用!OH7=\"\"),0,1)","v":0},{"$f":"IF(OR(EXACT(集計用!OI7,\"事業概要：\"),EXACT(集計用!OI7,\"ー\"),集計用!OI7=0,集計用!OI7=\"\"),0,1)","v":0},{"$f":"IF(OR(EXACT(集計用!OJ7,\"事業概要：\"),EXACT(集計用!OJ7,\"ー\"),集計用!OJ7=0,集計用!OJ7=\"\"),0,1)","v":0},{"$f":"IF(OR(EXACT(集計用!OK7,\"事業概要：\"),EXACT(集計用!OK7,\"ー\"),集計用!OK7=0,集計用!OK7=\"\"),0,1)","v":0},{"$f":"IF(OR(EXACT(集計用!OL7,\"事業概要：\"),EXACT(集計用!OL7,\"ー\"),集計用!OL7=0,集計用!OL7=\"\"),0,1)","v":0},{"$f":"IF(OR(EXACT(集計用!OM7,\"事業概要：\"),EXACT(集計用!OM7,\"ー\"),集計用!OM7=0,集計用!OM7=\"\"),0,1)","v":0},{"$f":"IF(OR(EXACT(集計用!ON7,\"事業概要：\"),EXACT(集計用!ON7,\"ー\"),集計用!ON7=0,集計用!ON7=\"\"),0,1)","v":0},{"$f":"IF(OR(EXACT(集計用!OO7,\"事業概要：\"),EXACT(集計用!OO7,\"ー\"),集計用!OO7=0,集計用!OO7=\"\"),0,1)","v":0},{"$f":"IF(OR(EXACT(集計用!OP7,\"事業概要：\"),EXACT(集計用!OP7,\"ー\"),集計用!OP7=0,集計用!OP7=\"\"),0,1)","v":0},{"$f":"IF(OR(EXACT(集計用!OQ7,\"事業概要：\"),EXACT(集計用!OQ7,\"ー\"),集計用!OQ7=0,集計用!OQ7=\"\"),0,1)","v":0},{"$f":"IF(OR(EXACT(集計用!OR7,\"事業概要：\"),EXACT(集計用!OR7,\"ー\"),集計用!OR7=0,集計用!OR7=\"\"),0,1)","v":0},{"$f":"IF(OR(EXACT(集計用!OS7,\"事業概要：\"),EXACT(集計用!OS7,\"ー\"),集計用!OS7=0,集計用!OS7=\"\"),0,1)","v":0},{"$f":"IF(OR(EXACT(集計用!OT7,\"事業概要：\"),EXACT(集計用!OT7,\"ー\"),集計用!OT7=0,集計用!OT7=\"\"),0,1)","v":0},{"$f":"IF(OR(EXACT(集計用!OU7,\"事業概要：\"),EXACT(集計用!OU7,\"ー\"),集計用!OU7=0,集計用!OU7=\"\"),0,1)","v":0},{"$f":"IF(OR(EXACT(集計用!OV7,\"事業概要：\"),EXACT(集計用!OV7,\"ー\"),集計用!OV7=0,集計用!OV7=\"\"),0,1)","v":0},{"$f":"IF(OR(EXACT(集計用!OW7,\"事業概要：\"),EXACT(集計用!OW7,\"ー\"),集計用!OW7=0,集計用!OW7=\"\"),0,1)","v":0},{"$f":"IF(OR(EXACT(集計用!OX7,\"事業概要：\"),EXACT(集計用!OX7,\"ー\"),集計用!OX7=0,集計用!OX7=\"\"),0,1)","v":0},{"$f":"IF(OR(EXACT(集計用!OY7,\"事業概要：\"),EXACT(集計用!OY7,\"ー\"),集計用!OY7=0,集計用!OY7=\"\"),0,1)","v":0},{"$f":"IF(OR(EXACT(集計用!OZ7,\"事業概要：\"),EXACT(集計用!OZ7,\"ー\"),集計用!OZ7=0,集計用!OZ7=\"\"),0,1)","v":0},{"$f":"IF(OR(EXACT(集計用!PA7,\"事業概要：\"),EXACT(集計用!PA7,\"ー\"),集計用!PA7=0,集計用!PA7=\"\"),0,1)","v":0},{"$f":"IF(OR(EXACT(集計用!PB7,\"事業概要：\"),EXACT(集計用!PB7,\"ー\"),集計用!PB7=0,集計用!PB7=\"\"),0,1)","v":0},{"$f":"IF(OR(EXACT(集計用!PC7,\"事業概要：\"),EXACT(集計用!PC7,\"ー\"),集計用!PC7=0,集計用!PC7=\"\"),0,1)","v":0},{"$f":"IF(OR(EXACT(集計用!PD7,\"事業概要：\"),EXACT(集計用!PD7,\"ー\"),集計用!PD7=0,集計用!PD7=\"\"),0,1)","v":0},{"$f":"IF(OR(EXACT(集計用!PE7,\"事業概要：\"),EXACT(集計用!PE7,\"ー\"),集計用!PE7=0,集計用!PE7=\"\"),0,1)","v":0},{"$f":"IF(OR(EXACT(集計用!PF7,\"事業概要：\"),EXACT(集計用!PF7,\"ー\"),集計用!PF7=0,集計用!PF7=\"\"),0,1)","v":0},{"$f":"IF(OR(EXACT(集計用!PG7,\"事業概要：\"),EXACT(集計用!PG7,\"ー\"),集計用!PG7=0,集計用!PG7=\"\"),0,1)","v":0},{"$f":"IF(OR(EXACT(集計用!PH7,\"事業概要：\"),EXACT(集計用!PH7,\"ー\"),集計用!PH7=0,集計用!PH7=\"\"),0,1)","v":0},{"$f":"IF(OR(EXACT(集計用!PI7,\"事業概要：\"),EXACT(集計用!PI7,\"ー\"),集計用!PI7=0,集計用!PI7=\"\"),0,1)","v":0},{"$f":"IF(OR(EXACT(集計用!PJ7,\"事業概要：\"),EXACT(集計用!PJ7,\"ー\"),集計用!PJ7=0,集計用!PJ7=\"\"),0,1)","v":0},{"$f":"IF(OR(EXACT(集計用!PK7,\"事業概要：\"),EXACT(集計用!PK7,\"ー\"),集計用!PK7=0,集計用!PK7=\"\"),0,1)","v":0},{"$f":"IF(OR(EXACT(集計用!PL7,\"事業概要：\"),EXACT(集計用!PL7,\"ー\"),集計用!PL7=0,集計用!PL7=\"\"),0,1)","v":0},{"$f":"IF(OR(EXACT(集計用!PM7,\"事業概要：\"),EXACT(集計用!PM7,\"ー\"),集計用!PM7=0,集計用!PM7=\"\"),0,1)","v":0},{"$f":"IF(OR(EXACT(集計用!PN7,\"事業概要：\"),EXACT(集計用!PN7,\"ー\"),集計用!PN7=0,集計用!PN7=\"\"),0,1)","v":0},{"$f":"IF(OR(EXACT(集計用!PO7,\"事業概要：\"),EXACT(集計用!PO7,\"ー\"),集計用!PO7=0,集計用!PO7=\"\"),0,1)","v":0},{"$f":"IF(OR(EXACT(集計用!PP7,\"事業概要：\"),EXACT(集計用!PP7,\"ー\"),集計用!PP7=0,集計用!PP7=\"\"),0,1)","v":0},{"$f":"IF(OR(EXACT(集計用!PQ7,\"事業概要：\"),EXACT(集計用!PQ7,\"ー\"),集計用!PQ7=0,集計用!PQ7=\"\"),0,1)","v":0},{"$f":"IF(OR(EXACT(集計用!PR7,\"事業概要：\"),EXACT(集計用!PR7,\"ー\"),集計用!PR7=0,集計用!PR7=\"\"),0,1)","v":0},{"$f":"IF(OR(EXACT(集計用!PS7,\"事業概要：\"),EXACT(集計用!PS7,\"ー\"),集計用!PS7=0,集計用!PS7=\"\"),0,1)","v":0},{"$f":"IF(OR(EXACT(集計用!PT7,\"事業概要：\"),EXACT(集計用!PT7,\"ー\"),集計用!PT7=0,集計用!PT7=\"\"),0,1)","v":0},{"$f":"IF(OR(EXACT(集計用!PU7,\"事業概要：\"),EXACT(集計用!PU7,\"ー\"),集計用!PU7=0,集計用!PU7=\"\"),0,1)","v":0},{"$f":"IF(OR(EXACT(集計用!PV7,\"事業概要：\"),EXACT(集計用!PV7,\"ー\"),集計用!PV7=0,集計用!PV7=\"\"),0,1)","v":0},{"$f":"IF(OR(EXACT(集計用!PW7,\"事業概要：\"),EXACT(集計用!PW7,\"ー\"),集計用!PW7=0,集計用!PW7=\"\"),0,1)","v":0},{"$f":"IF(OR(EXACT(集計用!PX7,\"事業概要：\"),EXACT(集計用!PX7,\"ー\"),集計用!PX7=0,集計用!PX7=\"\"),0,1)","v":0},{"$f":"IF(OR(EXACT(集計用!PY7,\"事業概要：\"),EXACT(集計用!PY7,\"ー\"),集計用!PY7=0,集計用!PY7=\"\"),0,1)","v":0},{"$f":"IF(OR(EXACT(集計用!PZ7,\"事業概要：\"),EXACT(集計用!PZ7,\"ー\"),集計用!PZ7=0,集計用!PZ7=\"\"),0,1)","v":0},{"$f":"IF(OR(EXACT(集計用!QA7,\"事業概要：\"),EXACT(集計用!QA7,\"ー\"),集計用!QA7=0,集計用!QA7=\"\"),0,1)","v":0},{"$f":"IF(OR(EXACT(集計用!QB7,\"事業概要：\"),EXACT(集計用!QB7,\"ー\"),集計用!QB7=0,集計用!QB7=\"\"),0,1)","v":0},{"$f":"IF(OR(EXACT(集計用!QC7,\"事業概要：\"),EXACT(集計用!QC7,\"ー\"),集計用!QC7=0,集計用!QC7=\"\"),0,1)","v":0},{"$f":"IF(OR(EXACT(集計用!QD7,\"事業概要：\"),EXACT(集計用!QD7,\"ー\"),集計用!QD7=0,集計用!QD7=\"\"),0,1)","v":0},{"$f":"IF(OR(EXACT(集計用!QE7,\"事業概要：\"),EXACT(集計用!QE7,\"ー\"),集計用!QE7=0,集計用!QE7=\"\"),0,1)","v":0},{"$f":"IF(OR(EXACT(集計用!QF7,\"事業概要：\"),EXACT(集計用!QF7,\"ー\"),集計用!QF7=0,集計用!QF7=\"\"),0,1)","v":0},{"$f":"IF(OR(EXACT(集計用!QG7,\"事業概要：\"),EXACT(集計用!QG7,\"ー\"),集計用!QG7=0,集計用!QG7=\"\"),0,1)","v":0},{"$f":"IF(OR(EXACT(集計用!QH7,\"事業概要：\"),EXACT(集計用!QH7,\"ー\"),集計用!QH7=0,集計用!QH7=\"\"),0,1)","v":0},{"$f":"IF(OR(EXACT(集計用!QI7,\"事業概要：\"),EXACT(集計用!QI7,\"ー\"),集計用!QI7=0,集計用!QI7=\"\"),0,1)","v":0},{"$f":"IF(OR(EXACT(集計用!QJ7,\"事業概要：\"),EXACT(集計用!QJ7,\"ー\"),集計用!QJ7=0,集計用!QJ7=\"\"),0,1)","v":0},{"$f":"IF(OR(EXACT(集計用!QK7,\"事業概要：\"),EXACT(集計用!QK7,\"ー\"),集計用!QK7=0,集計用!QK7=\"\"),0,1)","v":0},{"$f":"IF(OR(EXACT(集計用!QL7,\"事業概要：\"),EXACT(集計用!QL7,\"ー\"),集計用!QL7=0,集計用!QL7=\"\"),0,1)","v":0},{"$f":"IF(OR(EXACT(集計用!QM7,\"事業概要：\"),EXACT(集計用!QM7,\"ー\"),集計用!QM7=0,集計用!QM7=\"\"),0,1)","v":0},{"$f":"IF(OR(EXACT(集計用!QN7,\"事業概要：\"),EXACT(集計用!QN7,\"ー\"),集計用!QN7=0,集計用!QN7=\"\"),0,1)","v":0},{"$f":"IF(OR(EXACT(集計用!QO7,\"事業概要：\"),EXACT(集計用!QO7,\"ー\"),集計用!QO7=0,集計用!QO7=\"\"),0,1)","v":0},{"$f":"IF(OR(EXACT(集計用!QP7,\"事業概要：\"),EXACT(集計用!QP7,\"ー\"),集計用!QP7=0,集計用!QP7=\"\"),0,1)","v":0},{"$f":"IF(OR(EXACT(集計用!QQ7,\"事業概要：\"),EXACT(集計用!QQ7,\"ー\"),集計用!QQ7=0,集計用!QQ7=\"\"),0,1)","v":0},{"$f":"IF(OR(EXACT(集計用!QR7,\"事業概要：\"),EXACT(集計用!QR7,\"ー\"),集計用!QR7=0,集計用!QR7=\"\"),0,1)","v":0},{"$f":"IF(OR(EXACT(集計用!QS7,\"事業概要：\"),EXACT(集計用!QS7,\"ー\"),集計用!QS7=0,集計用!QS7=\"\"),0,1)","v":0},{"$f":"IF(OR(EXACT(集計用!QT7,\"事業概要：\"),EXACT(集計用!QT7,\"ー\"),集計用!QT7=0,集計用!QT7=\"\"),0,1)","v":0},{"$f":"IF(OR(EXACT(集計用!QU7,\"事業概要：\"),EXACT(集計用!QU7,\"ー\"),集計用!QU7=0,集計用!QU7=\"\"),0,1)","v":0},{"$f":"IF(OR(EXACT(集計用!QV7,\"事業概要：\"),EXACT(集計用!QV7,\"ー\"),集計用!QV7=0,集計用!QV7=\"\"),0,1)","v":0},{"$f":"IF(OR(EXACT(集計用!QW7,\"事業概要：\"),EXACT(集計用!QW7,\"ー\"),集計用!QW7=0,集計用!QW7=\"\"),0,1)","v":0},{"$f":"IF(OR(EXACT(集計用!QX7,\"事業概要：\"),EXACT(集計用!QX7,\"ー\"),集計用!QX7=0,集計用!QX7=\"\"),0,1)","v":0},{"$f":"IF(OR(EXACT(集計用!QY7,\"事業概要：\"),EXACT(集計用!QY7,\"ー\"),集計用!QY7=0,集計用!QY7=\"\"),0,1)","v":0},{"$f":"IF(OR(EXACT(集計用!QZ7,\"事業概要：\"),EXACT(集計用!QZ7,\"ー\"),集計用!QZ7=0,集計用!QZ7=\"\"),0,1)","v":0},{"$f":"IF(OR(EXACT(集計用!RA7,\"事業概要：\"),EXACT(集計用!RA7,\"ー\"),集計用!RA7=0,集計用!RA7=\"\"),0,1)","v":0},{"$f":"IF(OR(EXACT(集計用!RB7,\"事業概要：\"),EXACT(集計用!RB7,\"ー\"),集計用!RB7=0,集計用!RB7=\"\"),0,1)","v":0},{"$f":"IF(OR(EXACT(集計用!RC7,\"事業概要：\"),EXACT(集計用!RC7,\"ー\"),集計用!RC7=0,集計用!RC7=\"\"),0,1)","v":0},{"$f":"IF(OR(EXACT(集計用!RD7,\"事業概要：\"),EXACT(集計用!RD7,\"ー\"),集計用!RD7=0,集計用!RD7=\"\"),0,1)","v":0},{"$f":"IF(OR(EXACT(集計用!RE7,\"事業概要：\"),EXACT(集計用!RE7,\"ー\"),集計用!RE7=0,集計用!RE7=\"\"),0,1)","v":0},{"$f":"IF(OR(EXACT(集計用!RF7,\"事業概要：\"),EXACT(集計用!RF7,\"ー\"),集計用!RF7=0,集計用!RF7=\"\"),0,1)","v":0},{"$f":"IF(OR(EXACT(集計用!RG7,\"事業概要：\"),EXACT(集計用!RG7,\"ー\"),集計用!RG7=0,集計用!RG7=\"\"),0,1)","v":0},{"$f":"IF(OR(EXACT(集計用!RH7,\"事業概要：\"),EXACT(集計用!RH7,\"ー\"),集計用!RH7=0,集計用!RH7=\"\"),0,1)","v":0},{"$f":"IF(OR(EXACT(集計用!RI7,\"事業概要：\"),EXACT(集計用!RI7,\"ー\"),集計用!RI7=0,集計用!RI7=\"\"),0,1)","v":0},{"$f":"IF(OR(EXACT(集計用!RJ7,\"事業概要：\"),EXACT(集計用!RJ7,\"ー\"),集計用!RJ7=0,集計用!RJ7=\"\"),0,1)","v":0},{"$f":"IF(OR(EXACT(集計用!RK7,\"事業概要：\"),EXACT(集計用!RK7,\"ー\"),集計用!RK7=0,集計用!RK7=\"\"),0,1)","v":0},{"$f":"IF(OR(EXACT(集計用!RL7,\"事業概要：\"),EXACT(集計用!RL7,\"ー\"),集計用!RL7=0,集計用!RL7=\"\"),0,1)","v":0},{"$f":"IF(OR(EXACT(集計用!RM7,\"事業概要：\"),EXACT(集計用!RM7,\"ー\"),集計用!RM7=0,集計用!RM7=\"\"),0,1)","v":0},{"$f":"IF(OR(EXACT(集計用!RN7,\"事業概要：\"),EXACT(集計用!RN7,\"ー\"),集計用!RN7=0,集計用!RN7=\"\"),0,1)","v":0},{"$f":"IF(OR(EXACT(集計用!RO7,\"事業概要：\"),EXACT(集計用!RO7,\"ー\"),集計用!RO7=0,集計用!RO7=\"\"),0,1)","v":0},{"$f":"IF(OR(EXACT(集計用!RP7,\"事業概要：\"),EXACT(集計用!RP7,\"ー\"),集計用!RP7=0,集計用!RP7=\"\"),0,1)","v":0},{"$f":"IF(OR(EXACT(集計用!RQ7,\"事業概要：\"),EXACT(集計用!RQ7,\"ー\"),集計用!RQ7=0,集計用!RQ7=\"\"),0,1)","v":0},{"$f":"IF(OR(EXACT(集計用!RR7,\"事業概要：\"),EXACT(集計用!RR7,\"ー\"),集計用!RR7=0,集計用!RR7=\"\"),0,1)","v":0},{"$f":"IF(OR(EXACT(集計用!RS7,\"事業概要：\"),EXACT(集計用!RS7,\"ー\"),集計用!RS7=0,集計用!RS7=\"\"),0,1)","v":0},{"$f":"IF(OR(EXACT(集計用!RT7,\"事業概要：\"),EXACT(集計用!RT7,\"ー\"),集計用!RT7=0,集計用!RT7=\"\"),0,1)","v":0},{"$f":"IF(OR(EXACT(集計用!RU7,\"事業概要：\"),EXACT(集計用!RU7,\"ー\"),集計用!RU7=0,集計用!RU7=\"\"),0,1)","v":0},{"$f":"IF(OR(EXACT(集計用!RV7,\"事業概要：\"),EXACT(集計用!RV7,\"ー\"),集計用!RV7=0,集計用!RV7=\"\"),0,1)","v":0},{"$f":"IF(OR(EXACT(集計用!RW7,\"事業概要：\"),EXACT(集計用!RW7,\"ー\"),集計用!RW7=0,集計用!RW7=\"\"),0,1)","v":0},{"$f":"IF(OR(EXACT(集計用!RX7,\"事業概要：\"),EXACT(集計用!RX7,\"ー\"),集計用!RX7=0,集計用!RX7=\"\"),0,1)","v":0},{"$f":"IF(OR(EXACT(集計用!RY7,\"事業概要：\"),EXACT(集計用!RY7,\"ー\"),集計用!RY7=0,集計用!RY7=\"\"),0,1)","v":0},{"$f":"IF(OR(EXACT(集計用!RZ7,\"事業概要：\"),EXACT(集計用!RZ7,\"ー\"),集計用!RZ7=0,集計用!RZ7=\"\"),0,1)","v":0},{"$f":"IF(OR(EXACT(集計用!SA7,\"事業概要：\"),EXACT(集計用!SA7,\"ー\"),集計用!SA7=0,集計用!SA7=\"\"),0,1)","v":0},{"$f":"IF(OR(EXACT(集計用!SB7,\"事業概要：\"),EXACT(集計用!SB7,\"ー\"),集計用!SB7=0,集計用!SB7=\"\"),0,1)","v":0},{"$f":"IF(OR(EXACT(集計用!SC7,\"事業概要：\"),EXACT(集計用!SC7,\"ー\"),集計用!SC7=0,集計用!SC7=\"\"),0,1)","v":0},{"$f":"IF(OR(EXACT(集計用!SD7,\"事業概要：\"),EXACT(集計用!SD7,\"ー\"),集計用!SD7=0,集計用!SD7=\"\"),0,1)","v":0},{"$f":"IF(OR(EXACT(集計用!SE7,\"事業概要：\"),EXACT(集計用!SE7,\"ー\"),集計用!SE7=0,集計用!SE7=\"\"),0,1)","v":0},{"$f":"IF(OR(EXACT(集計用!SF7,\"事業概要：\"),EXACT(集計用!SF7,\"ー\"),集計用!SF7=0,集計用!SF7=\"\"),0,1)","v":0},{"$f":"IF(OR(EXACT(集計用!SG7,\"事業概要：\"),EXACT(集計用!SG7,\"ー\"),集計用!SG7=0,集計用!SG7=\"\"),0,1)","v":0},{"$f":"IF(OR(EXACT(集計用!SH7,\"事業概要：\"),EXACT(集計用!SH7,\"ー\"),集計用!SH7=0,集計用!SH7=\"\"),0,1)","v":0},{"$f":"IF(OR(EXACT(集計用!SI7,\"事業概要：\"),EXACT(集計用!SI7,\"ー\"),集計用!SI7=0,集計用!SI7=\"\"),0,1)","v":0},{"$f":"IF(OR(EXACT(集計用!SJ7,\"事業概要：\"),EXACT(集計用!SJ7,\"ー\"),集計用!SJ7=0,集計用!SJ7=\"\"),0,1)","v":0},{"$f":"IF(OR(EXACT(集計用!SK7,\"事業概要：\"),EXACT(集計用!SK7,\"ー\"),集計用!SK7=0,集計用!SK7=\"\"),0,1)","v":0},{"$f":"IF(OR(EXACT(集計用!SL7,\"事業概要：\"),EXACT(集計用!SL7,\"ー\"),集計用!SL7=0,集計用!SL7=\"\"),0,1)","v":0},{"$f":"IF(OR(EXACT(集計用!SM7,\"事業概要：\"),EXACT(集計用!SM7,\"ー\"),集計用!SM7=0,集計用!SM7=\"\"),0,1)","v":0},{"$f":"IF(OR(EXACT(集計用!SN7,\"事業概要：\"),EXACT(集計用!SN7,\"ー\"),集計用!SN7=0,集計用!SN7=\"\"),0,1)","v":0},{"$f":"IF(OR(EXACT(集計用!SO7,\"事業概要：\"),EXACT(集計用!SO7,\"ー\"),集計用!SO7=0,集計用!SO7=\"\"),0,1)","v":0},{"$f":"IF(OR(EXACT(集計用!SP7,\"事業概要：\"),EXACT(集計用!SP7,\"ー\"),集計用!SP7=0,集計用!SP7=\"\"),0,1)","v":0},{"$f":"IF(OR(EXACT(集計用!SQ7,\"事業概要：\"),EXACT(集計用!SQ7,\"ー\"),集計用!SQ7=0,集計用!SQ7=\"\"),0,1)","v":0},{"$f":"IF(OR(EXACT(集計用!SR7,\"事業概要：\"),EXACT(集計用!SR7,\"ー\"),集計用!SR7=0,集計用!SR7=\"\"),0,1)","v":0},{"$f":"IF(OR(EXACT(集計用!SS7,\"事業概要：\"),EXACT(集計用!SS7,\"ー\"),集計用!SS7=0,集計用!SS7=\"\"),0,1)","v":0},{"$f":"IF(OR(EXACT(集計用!ST7,\"事業概要：\"),EXACT(集計用!ST7,\"ー\"),集計用!ST7=0,集計用!ST7=\"\"),0,1)","v":0},{"$f":"IF(OR(EXACT(集計用!SU7,\"事業概要：\"),EXACT(集計用!SU7,\"ー\"),集計用!SU7=0,集計用!SU7=\"\"),0,1)","v":0},{"$f":"IF(OR(EXACT(集計用!SV7,\"事業概要：\"),EXACT(集計用!SV7,\"ー\"),集計用!SV7=0,集計用!SV7=\"\"),0,1)","v":0},{"$f":"IF(OR(EXACT(集計用!SW7,\"事業概要：\"),EXACT(集計用!SW7,\"ー\"),集計用!SW7=0,集計用!SW7=\"\"),0,1)","v":0},{"$f":"IF(OR(EXACT(集計用!SX7,\"事業概要：\"),EXACT(集計用!SX7,\"ー\"),集計用!SX7=0,集計用!SX7=\"\"),0,1)","v":0},{"$f":"IF(OR(EXACT(集計用!SY7,\"事業概要：\"),EXACT(集計用!SY7,\"ー\"),集計用!SY7=0,集計用!SY7=\"\"),0,1)","v":0},{"$f":"IF(OR(EXACT(集計用!SZ7,\"事業概要：\"),EXACT(集計用!SZ7,\"ー\"),集計用!SZ7=0,集計用!SZ7=\"\"),0,1)","v":0},{"$f":"IF(OR(EXACT(集計用!TA7,\"事業概要：\"),EXACT(集計用!TA7,\"ー\"),集計用!TA7=0,集計用!TA7=\"\"),0,1)","v":0},{"$f":"IF(OR(EXACT(集計用!TB7,\"事業概要：\"),EXACT(集計用!TB7,\"ー\"),集計用!TB7=0,集計用!TB7=\"\"),0,1)","v":0},{"$f":"IF(OR(EXACT(集計用!TC7,\"事業概要：\"),EXACT(集計用!TC7,\"ー\"),集計用!TC7=0,集計用!TC7=\"\"),0,1)","v":0},{"$f":"IF(OR(EXACT(集計用!TD7,\"事業概要：\"),EXACT(集計用!TD7,\"ー\"),集計用!TD7=0,集計用!TD7=\"\"),0,1)","v":0},{"$f":"IF(OR(EXACT(集計用!TE7,\"事業概要：\"),EXACT(集計用!TE7,\"ー\"),集計用!TE7=0,集計用!TE7=\"\"),0,1)","v":0},{"$f":"IF(OR(EXACT(集計用!TF7,\"事業概要：\"),EXACT(集計用!TF7,\"ー\"),集計用!TF7=0,集計用!TF7=\"\"),0,1)","v":0}]
["F","F","F","F","F","T","T","T","T","T","T","T","T","T","T","T","T","T","T","F","T","T","T","F","F","F","F","F","F","F","F","F","F","F","F","F","F","F","F","F","F","F","F","F","F","F","F","F","F","F","T","T","F","T","T","F","F","T","F","F","F","F","F","T","T","F","F","T","F","F","F","F","F","T","T","F","F","T","F","F","F","F","F","T","T","F","F","T","F","F","F","F","F","T","T","F","F","T","F","F","F","F","F","T","T","F","F","T","F","F","F","F","F","T","T","F","F","T","F","F","F","F","F","T","T","F","F","T","F","F","F","F","F","T","T","F","F","T","F","F","F","F","F","T","T","F","F","T","F","F","F","F","F","T","T","F","F","T","F","F","F","F","F","T","T","F","F","T","F","F","F","F","F","T","T","F","F","T","F","F","F","F","F","T","T","F","F","T","F","F","F","F","F","T","T","F","F","T","F","F","F","F","F","T","T","F","F","T","F","F","F","F","F","T","T","F","F","T","F","F","F","F","F","T","T","F","F","T","F","F","F","F","F","T","T","F","F","T","F","F","F","F","F","T","T","F","F","T","F","F","F","F","F","T","T","F","F","T","F","F","F","F","F","T","T","F","F","T","F","F","F","F","F","T","T","F","F","T","F","F","F","F","F","T","T","F","F","T","F","F","F","F","F","T","T","F","F","T","F","F","F","F","F","T","T","T","F","F","T","F","F","F","F","F","T","T","T","F","F","T","F","F","F","F","F","T","T","F","F","T","F","F","F","F","F","T","T","F","F","T","F","F","F","F","F","F","T","F","F","T","F","F","F","F","F","T","T","F","F","T","F","F","F","F","F","T","T","F","F","T","F","F","F","F","F","T","T","T","F","F","T","F","F","F","F","F","T","T","F","F","T","F","F","F","F","F","T","T","F","F","T","F","F","F","F","F","T","T","F","F","T","F","F","F","F","F","T","T","T","F","F","T","F","F","F","F","F","T","T","T","F","F","T","F","F","F","F","F","T","F","F","T","F","F","F","F","F","T","T","F","F","T","F","F","F","F","F","T","T","T","T","F","F","T","F","F","F","F","F","T","T","T","F","F","T","F","F","F","F","F","T","T","T","F","F","T","F","F","F","F","F","T","T","T","F","F","T","F","F","F","F","F","T","T","T","T","F","F","T","F","F","F","F","F","T","T","T","F","F","T","F","F","F","F","F","T"]
[null,null,null,null,null,0,0,0,0,0,0,0,null,0,0,0,0,0,0,null,null,null,null,null,null,null,null,null,null,null,null,null,null,null,null,null,null,null,null,null,null,null,null,null,null,null,null,null,null,null,0,0,null,0,0,null,null,null,null,null,null,null,null,0,0,null,null,null,null,null,null,null,null,0,0,null,null,null,null,null,null,null,null,0,0,null,null,null,null,null,null,null,null,0,0,null,null,null,null,null,null,null,null,0,0,null,null,0,null,null,null,null,null,0,0,null,null,0,null,null,null,null,null,0,0,null,null,0,null,null,null,null,null,0,0,null,null,0,null,null,null,null,null,0,0,null,null,0,null,null,null,null,null,0,0,null,null,null,null,null,null,null,null,0,0,null,null,0,null,null,null,null,null,0,0,null,null,null,null,null,null,null,null,0,0,null,null,null,null,null,null,null,null,0,0,null,null,0,null,null,null,null,null,0,0,null,null,null,null,null,null,null,null,0,0,null,null,0,null,null,null,null,null,0,0,null,null,null,null,null,null,null,null,0,0,null,null,0,null,null,null,null,null,0,0,null,null,null,null,null,null,null,null,0,0,null,null,0,null,null,null,null,null,0,0,null,null,null,null,null,null,null,null,0,0,null,null,0,null,null,null,null,null,0,0,null,null,0,null,null,null,null,null,0,0,null,null,0,null,null,null,null,null,0,0,0,null,null,0,null,null,null,null,null,0,0,0,null,null,0,null,null,null,null,null,0,0,null,null,null,null,null,null,null,null,0,0,null,null,0,null,null,null,null,null,null,0,null,null,0,null,null,null,null,null,0,0,null,null,null,null,null,null,null,null,0,0,null,null,0,null,null,null,null,null,0,0,0,null,null,null,null,null,null,null,null,0,0,null,null,null,null,null,null,null,null,0,0,null,null,0,null,null,null,null,null,0,0,null,null,0,null,null,null,null,null,0,0,0,null,null,0,null,null,null,null,null,0,0,0,null,null,null,null,null,null,null,null,0,null,null,null,null,null,null,null,null,null,0,null,null,null,null,null,null,null,null,null,null,0,0,null,null,null,null,null,null,null,null,null,0,0,null,null,null,null,null,null,null,null,null,0,0,null,null,null,null,null,null,null,null,null,0,0,null,null,null,null,null,null,null,null,0,null,0,0,null,null,null,null,null,null,null,null,null,0,0]
[]
[null,null,null,null,null,2,2,2,2,1,2,2,1,2,1,2,1,3,2,1,1,1,1,1,1,1,1,1,1,1,1,1,1,1,1,1,1,1,1,1,1,1,1,1,1,1,1,1,1,1,1,1,2,1,1,1,1,1,1,1,1,1,1,1,1,1,1,1,1,1,1,1,1,1,1,1,1,1,1,1,1,1,1,1,1,1,1,1,1,1,1,1,1,1,1,1,1,1,1,1,1,1,1,1,1,1,1,1,1,1,1,1,1,1,1,1,1,1,1,1,1,1,1,1,1,1,1,1,1,1,1,1,1,1,1,1,1,1,1,1,1,1,1,1,1,1,1,1,1,1,1,1,1,1,1,1,1,1,1,1,1,1,1,1,1,1,1,1,1,1,1,1,1,1,1,1,1,1,1,1,1,1,1,1,1,1,1,1,1,1,1,1,1,1,1,1,1,1,1,1,1,1,1,1,1,1,1,1,1,1,1,1,1,1,1,1,1,1,1,1,1,1,1,1,1,1,1,1,1,1,1,1,1,1,1,1,1,1,1,1,1,1,1,1,1,1,1,1,1,1,1,1,1,1,1,1,1,1,1,1,1,1,1,1,1,1,1,1,1,1,1,1,1,1,1,1,1,1,1,1,1,1,1,1,1,1,1,1,1,1,1,1,1,1,1,1,1,1,1,1,1,1,1,2,1,1,1,1,1,1,1,1,1,1,2,1,1,1,1,1,1,1,1,1,1,1,1,1,1,1,1,1,1,1,1,1,1,1,1,1,1,1,1,1,1,1,1,1,1,1,1,1,1,1,1,1,1,1,1,1,1,1,1,1,1,1,1,1,1,1,1,1,1,1,1,2,1,1,1,1,1,1,1,1,1,1,1,1,1,1,1,1,1,1,1,1,1,1,1,1,1,1,1,1,1,1,1,1,1,1,1,1,1,1,1,1,1,1,1,1,1,1,1,1,1,1,1,1,1,1,1,1,1,1,1,1,1,1,1,1,1,1,1,1,1,1,1,2,1,1,1,1,1,1,1,1,1,2,1,1,1,1,1,1,1,1,1,1,1,1,1,1,1,1,1,1,1,1,1,1,1,1,1,1,1,1,1,1,1,1,1,1,1,1,1,1,1,1,1,1,1,1,2,1,1,1,1,1,1,1,1,1,1,1,2,2,1,1,1,1,1,1,1,1,1,2]
[]
[null,null,null,null,null,null,"二種免許","特例講習",null,50,51,52,53,54,55,56,57]
["認証状況","えるぼし","くるみん","倍率",null,"保有車両数×1/2","内示人数","内示人数",null,"平均要望額×保有車両数×0.95","平均要望額×保有車両数×0.95","平均要望額×保有車両数×0.95","平均要望額×保有車両数×0.95","平均要望額×保有車両数×0.95","平均要望額×保有車両数×0.95","平均要望額×保有車両数×0.95","平均要望額×保有車両数×0.95"]
[{"$f":"IF(集計用!U7=5,2,IF(集計用!U7=4,1.5,IF(集計用!U7=3,1,0.5)))","v":0.5},{"$f":"IF(AND(集計用!V7>=3,ISNUMBER(集計用!V7),集計用!V7<>\"\"),1.5,1)","v":1},{"$f":"IF(AND(集計用!W7>=3,ISNUMBER(集計用!W7),集計用!W7<>\"\"),1.5,1)","v":1},{"$f":"A16*MAX(B16,C16)","v":0.5},null,{"$f":"IFERROR(IF(ROUNDDOWN(集計用!AZ7/2,0)=0,1,ROUNDDOWN(集計用!AZ7/2,0)),0)","v":1},{"$f":"IF(貸切バス!M287<=2,貸切バス!M287,MIN(F16,貸切バス!M287))","v":0},{"$f":"IF(貸切バス!M288<=2,貸切バス!M288,MIN(F16,貸切バス!M288))","v":0},null,{"$f":"IFERROR(ROUNDDOWN(IF(集計用!$AZ$7=\"\",\"\",(J23*集計用!$AZ$7*0.95)),0),\"\")","v":0},{"$f":"IFERROR(ROUNDDOWN(IF(集計用!$AZ$7=\"\",\"\",(K23*集計用!$AZ$7*0.95)),0),\"\")","v":0},{"$f":"IFERROR(ROUNDDOWN(IF(集計用!$AZ$7=\"\",\"\",(L23*集計用!$AZ$7*0.95)),0),\"\")","v":0},{"$f":"IFERROR(ROUNDDOWN(IF(集計用!$AZ$7=\"\",\"\",(M23*集計用!$AZ$7*0.95)),0),\"\")","v":0},{"$f":"IFERROR(ROUNDDOWN(IF(集計用!$AZ$7=\"\",\"\",(N23*集計用!$AZ$7*0.95)),0),\"\")","v":0},{"$f":"IFERROR(ROUNDDOWN(IF(集計用!$AZ$7=\"\",\"\",(O23*集計用!$AZ$7*0.95)),0),\"\")","v":0},{"$f":"IFERROR(ROUNDDOWN(IF(集計用!$AZ$7=\"\",\"\",(P23*集計用!$AZ$7*0.95)),0),\"\")","v":0},{"$f":"IFERROR(ROUNDDOWN(IF(集計用!$AZ$7=\"\",\"\",(Q23*集計用!$AZ$7*0.95)),0),\"\")","v":0}]
[]
[null,null,null,null,null,null,null,null,null,"保有車両数合計","保有車両数合計","保有車両数合計","保有車両数合計","保有車両数合計","保有車両数合計","保有車両数合計","保有車両数合計"]
[null,null,null,null,null,null,null,null,null,3508,6021,37,24,0,2376,1287,1773]
[null,null,null,null,null,null,null,null,null,"要望額合計","要望額合計","要望額合計","要望額合計","要望額合計","要望額合計","要望額合計","要望額合計"]
[null,null,null,null,null,null,null,null,null,46882,225457,0,111,0,17249,12850,21215]
[null,null,null,null,null,null,null,null,null,"平均要望額","平均要望額","平均要望額","平均要望額","平均要望額","平均要望額","平均要望額","平均要望額"]
[null,null,null,null,null,null,null,null,null,13.364310148232612,37.445108785915963,0.60672116257947317,4.625,3.1035793768545994,7.259680134680135,9.9844599844599848,11.965595036661027]
[null,null,null,null,null,null,null,null,null,null,null,"※平均要望額がなかったため、B-67の平均要望額を参照",null,"※平均要望額がなかったため、B-69の平均要望額を参照"]

{"sheet":"補助","index":3,"n_rows":1145,"n_cols":24,"rows_kept":1145,"cut":false,"hidden":true,"merged":[]}
[null,{"$f":"YEAR(TODAY()) - YEAR(DATE(2019, 5, 1)) + 1","v":6},"C:\\Users\\dxgxstaff140\\Desktop"]
[null,{"$f":"MONTH(TODAY())","v":7},"qwrwqr様式第1A.pdf",null,"金融機関等\nコード","金融機関等\n名称",null,null,"口座名義（フリガナ）",null,null,null,"中央値","補助対象経費","数","下限","上限","下限計算式","上限計算式",null,null,null,null,"F4"]
[null,{"$f":"DAY(TODAY())","v":2},"C:\\Users\\dxgxstaff140\\Desktop",null,null,null,null,null,"使用可能文字一覧",null,null,null,null,null,null,null,null,null,null,null,null,null,null,"M4"]
[null,null,"qwrwqr様式第1B.pdf",null,1,"みずほ",null,null,"ｱ",null,null,null,39650000,"$P$109","$M$109",3965000,396500000,{"$f":"M4/10","v":3965000},{"$f":"M4*10","v":396500000},null,null,null,null,"F6"]
["MM29",null,null,null,5,"三菱ＵＦＪ",null,null,"ｲ",null,null,null,53000000,"$P$111","$M$111",5300000,530000000,{"$f":"M5/10","v":5300000},{"$f":"M5*10","v":530000000},null,null,null,null,"M6"]
[null,null,null,null,9,"三井住友",null,null,"ｳ",null,null,null,22000000,"$P$168","$M$168",2200000,220000000,2200000,220000000,null,null,null,null,"F8"]
[null,null,null,null,10,"りそな",null,null,"ｴ",null,null,null,22000000,"$P$170","$M$170",2200000,220000000,2200000,220000000,null,null,null,null,"M8"]
[null,null,null,null,17,"埼玉りそな",null,null,"ｵ",null,null,null,11975435,"$P$172","$M$172",1197543.5,119754350,1197543.5,119754350,null,null,null,null,"F15"]
[null,null,null,null,33,"ＰａｙＰａｙ",null,null,"ｶ",null,null,null,22000000,"$P$174","$M$174",2200000,220000000,2200000,220000000,null,null,null,null,"M15"]
[null,null,null,null,34,"セブン",null,null,"ｷ",null,null,null,7497900,"$P$176","$M$176",749790,74979000,749790,74979000,null,null,null,null,"F17"]
[null,null,null,null,35,"ソニー",null,null,"ｸ",null,null,null,783890,"$P$181","$M$181",78389,7838900,78389,7838900,null,null,null,null,"F19"]
[null,null,null,null,36,"楽天",null,null,"ｹ",null,null,null,483500,"$P$182","$M$182",48350,4835000,48350,4835000,null,null,null,null,"F21"]
[null,null,null,null,38,"住信ＳＢＩネット",null,null,"ｺ",null,null,null,447466.34615384613,"$P$183","$M$183",44746.63461538461,4474663.461538461,44746.63461538461,4474663.461538461,null,null,null,null,"F23"]
[null,null,null,null,39,"ａｕじぶん",null,null,"ｻ",null,null,null,1000000,"$P$184","$M$184",100000,10000000,100000,10000000,null,null,null,null,"F25"]
[null,null,null,null,40,"イオン",null,null,"ｼ",null,null,null,1470000,"$P$185","$M$185",147000,14700000,147000,14700000,null,null,null,null,"F27"]
[null,null,null,null,41,"大和ネクスト",null,null,"ｽ",null,null,null,968000,"$P$191","$M$191",96800,9680000,96800,9680000,null,null,null,null,"S283"]
[null,null,null,null,42,"ローソン",null,null,"ｾ",null,null,null,500000,"$P$192","$M$192",50000,5000000,50000,5000000,null,null,null,null,"S284"]
[null,null,null,null,43,"みんなの",null,null,"ｿ",null,null,null,2260000,"$P$207","$M$207",226000,22600000,226000,22600000,null,null,null,null,"M109"]
[null,null,null,null,44,"ＵＩ",null,null,"ﾀ",null,null,null,1500000,"$P$208","$M$208",150000,15000000,150000,15000000,null,null,null,null,"P109"]
[null,null,null,null,116,"北海道",null,null,"ﾁ",null,null,null,582700,"$P$209","$M$209",58270,5827000,58270,5827000,null,null,null,null,"M111"]
[null,null,null,null,117,"青森",null,null,"ﾂ",null,null,null,7380000,"$P$210","$M$210",738000,73800000,738000,73800000,null,null,null,null,"P111"]
[null,null,null,null,118,"みちのく",null,null,"ﾃ",null,null,null,2720000,"$P$211","$M$211",272000,27200000,272000,27200000,null,null,null,null,"M168"]
[null,null,null,null,119,"秋田",null,null,"ﾄ",null,null,null,804150,"$P$217","$M$217",80415,8041500,80415,8041500,null,null,null,null,"P168"]
[null,null,null,null,120,"北都",null,null,"ﾅ",null,null,null,5000000,"$P$218","$M$218",500000,50000000,500000,50000000,null,null,null,null,"M170"]
[null,null,null,null,121,"荘内",null,null,"ﾆ",null,null,null,2450000,"$P$219","$M$219",245000,24500000,245000,24500000,null,null,null,null,"P170"]
[null,null,null,null,122,"山形",null,null,"ﾇ",null,null,null,1900000,"$P$220","$M$220",190000,19000000,190000,19000000,null,null,null,null,"M172"]
[null,null,null,null,123,"岩手",null,null,"ﾈ",null,null,null,1000000,"$P$221","$M$221",100000,10000000,100000,10000000,null,null,null,null,"P172"]
[null,null,null,null,124,"東北",null,null,"ﾉ",null,null,null,468000,"$P$222","$M$222",46800,4680000,46800,4680000,null,null,null,null,"M174"]
[null,null,null,null,125,"七十七",null,null,"ﾊ",null,null,null,500000,"$P$229","$M$229",50000,5000000,50000,5000000,null,null,null,null,"P174"]
[null,null,null,null,126,"東邦",null,null,"ﾋ",null,null,null,94182,"$P$246","$M$246",9418.2000000000007,941820,9418.2000000000007,941820,null,null,null,null,"M176"]
[null,null,null,null,128,"群馬",null,null,"ﾌ",null,null,null,31800,"$P$247","$M$247",3180,318000,3180,318000,null,null,null,null,"P176"]
[null,null,null,null,129,"足利",null,null,"ﾍ",null,null,null,5000000,"$P$248","$M$248",500000,50000000,500000,50000000,null,null,null,null,"M181"]
[null,null,null,null,130,"常陽",null,null,"ﾎ",null,null,null,670000,"$P$249","$M$249",67000,6700000,67000,6700000,null,null,null,null,"P181"]
[null,null,null,null,131,"筑波",null,null,"ﾏ",null,null,null,70000,"$P$250","$M$250",7000,700000,7000,700000,null,null,null,null,"M182"]
[null,null,null,null,133,"武蔵野",null,null,"ﾐ",null,null,null,680000,"$P$251","$M$251",68000,6800000,68000,6800000,null,null,null,null,"P182"]
[null,null,null,null,134,"千葉",null,null,"ﾑ",null,null,null,50000,"$P$258","$M$258",5000,500000,5000,500000,null,null,null,null,"M183"]
[null,null,null,null,135,"千葉興業",null,null,"ﾒ",null,null,null,544704.28571428568,"$P$264","$M$264",54470.428571428565,5447042.8571428563,54470.428571428565,5447042.8571428563,null,null,null,null,"P183"]
[null,null,null,null,137,"きらぼし",null,null,"ﾓ",null,null,null,249445,"$P$265","$M$265",24944.5,2494450,24944.5,2494450,null,null,null,null,"M184"]
[null,null,null,null,138,"横浜",null,null,"ﾔ",null,null,null,10272.666666666666,"$P$266","$M$266",1027.2666666666667,102726.66666666666,1027.2666666666667,102726.66666666666,null,null,null,null,"P184"]
[null,null,null,null,140,"第四北越",null,null,"ﾕ",null,null,null,438900,"$P$287","$M$287",43890,4389000,43890,4389000,null,null,null,null,"M185"]
[null,null,null,null,142,"山梨中央",null,null,"ﾖ",null,null,null,271000,"$P$288","$M$288",27100,2710000,27100,2710000,null,null,null,null,"P185"]
[null,null,null,null,143,"八十二",null,null,"ﾗ",null,null,null,1200000,"$P$308","$M$308",120000,12000000,120000,12000000,null,null,null,null,"M191"]
[null,null,null,null,144,"北陸",null,null,"ﾘ",null,null,null,1000000,"$P$314","$M$314",100000,10000000,100000,10000000,null,null,null,null,"P191"]
[null,null,null,null,145,"富山",null,null,"ﾙ",null,null,null,3091,"$P$336","$M$336",309.10000000000002,30910,309.10000000000002,30910,null,null,null,null,"M192"]
[null,null,null,null,146,"北國",null,null,"ﾚ",null,null,null,36104.5,"$P$337","$M$337",3610.45,361045,3610.45,361045,null,null,null,null,"P192"]
[null,null,null,null,147,"福井",null,null,"ﾛ",null,null,null,35000,"$P$338","$M$338",3500,350000,3500,350000,null,null,null,null,"M207"]
[null,null,null,null,149,"静岡",null,null,"ﾜ",null,null,null,46545.5,"$P$339","$M$339",4654.55,465455,4654.55,465455,null,null,null,null,"P207"]
[null,null,null,null,150,"スルガ",null,null,"ﾝ",null,null,null,17424.242424242424,"$P$343","$M$343",1742.4242424242425,174242.42424242425,1742.4242424242425,174242.42424242425,null,null,null,null,"M208"]
[null,null,null,null,151,"清水",null,null,"ﾞ",null,null,null,240946,"$P$355","$M$355",24094.6,2409460,24094.6,2409460,null,null,null,null,"P208"]
[null,null,null,null,152,"大垣共立",null,null,"ﾟ",null,null,null,null,null,null,null,null,null,null,null,null,null,null,"M209"]
[null,null,null,null,153,"十六",null,null,"0",null,null,null,null,null,null,null,null,null,null,null,null,null,null,"P209"]
[null,null,null,null,154,"三十三",null,null,"1",null,null,null,null,null,null,null,null,null,null,null,null,null,null,"M210"]
[null,null,null,null,155,"百五",null,null,"2",null,null,null,null,null,null,null,null,null,null,null,null,null,null,"P210"]
[null,null,null,null,157,"滋賀",null,null,"3",null,null,null,null,null,null,null,null,null,null,null,null,null,null,"M211"]
[null,null,null,null,158,"京都",null,null,"4",null,null,null,null,null,null,null,null,null,null,null,null,null,null,"P211"]
[null,null,null,null,159,"関西みらい",null,null,"5",null,null,null,null,null,null,null,null,null,null,null,null,null,null,"M217"]
[null,null,null,null,161,"池田泉州",null,null,"6",null,null,null,null,null,null,null,null,null,null,null,null,null,null,"P217"]
[null,null,null,null,162,"南都",null,null,"7",null,null,null,null,null,null,null,null,null,null,null,null,null,null,"M218"]
[null,null,null,null,163,"紀陽",null,null,"8",null,null,null,null,null,null,null,null,null,null,null,null,null,null,"P218"]
[null,null,null,null,164,"但馬",null,null,"9",null,null,null,null,null,null,null,null,null,null,null,null,null,null,"M219"]
[null,null,null,null,166,"鳥取",null,null,"A",null,null,null,null,null,null,null,null,null,null,null,null,null,null,"P219"]
[null,null,null,null,167,"山陰合同",null,null,"B",null,null,null,null,null,null,null,null,null,null,null,null,null,null,"M220"]
[null,null,null,null,168,"中国",null,null,"C",null,null,null,null,null,null,null,null,null,null,null,null,null,null,"P220"]
[null,null,null,null,169,"広島",null,null,"D",null,null,null,null,null,null,null,null,null,null,null,null,null,null,"M221"]
[null,null,null,null,170,"山口",null,null,"E",null,null,null,null,null,null,null,null,null,null,null,null,null,null,"P221"]
[null,null,null,null,172,"阿波",null,null,"F",null,null,null,null,null,null,null,null,null,null,null,null,null,null,"M222"]
[null,null,null,null,173,"百十四",null,null,"G",null,null,null,null,null,null,null,null,null,null,null,null,null,null,"P222"]
[null,null,null,null,174,"伊予",null,null,"H",null,null,null,null,null,null,null,null,null,null,null,null,null,null,"E223"]
[null,null,null,null,175,"四国",null,null,"I",null,null,null,null,null,null,null,null,null,null,null,null,null,null,"M229"]
[null,null,null,null,177,"福岡",null,null,"J",null,null,null,null,null,null,null,null,null,null,null,null,null,null,"P229"]
[null,null,null,null,178,"筑邦",null,null,"K",null,null,null,null,null,null,null,null,null,null,null,null,null,null,"E230"]
[null,null,null,null,179,"佐賀",null,null,"L",null,null,null,null,null,null,null,null,null,null,null,null,null,null,"M246"]
[null,null,null,null,181,"十八親和",null,null,"M",null,null,null,null,null,null,null,null,null,null,null,null,null,null,"P246"]
[null,null,null,null,182,"肥後",null,null,"N",null,null,null,null,null,null,null,null,null,null,null,null,null,null,"M247"]
[null,null,null,null,183,"大分",null,null,"O",null,null,null,null,null,null,null,null,null,null,null,null,null,null,"P247"]
[null,null,null,null,184,"宮崎",null,null,"P",null,null,null,null,null,null,null,null,null,null,null,null,null,null,"M248"]
[null,null,null,null,185,"鹿児島",null,null,"Q",null,null,null,null,null,null,null,null,null,null,null,null,null,null,"P248"]
[null,null,null,null,187,"琉球",null,null,"R",null,null,null,null,null,null,null,null,null,null,null,null,null,null,"P249"]
[null,null,null,null,188,"沖縄",null,null,"S",null,null,null,null,null,null,null,null,null,null,null,null,null,null,"M250"]
[null,null,null,null,190,"西日本シティ",null,null,"T",null,null,null,null,null,null,null,null,null,null,null,null,null,null,"P250"]
[null,null,null,null,191,"北九州",null,null,"U",null,null,null,null,null,null,null,null,null,null,null,null,null,null,"M251"]
[null,null,null,null,288,"三菱ＵＦＪ信託",null,null,"V",null,null,null,null,null,null,null,null,null,null,null,null,null,null,"P251"]
[null,null,null,null,289,"みずほ信託",null,null,"W",null,null,null,null,null,null,null,null,null,null,null,null,null,null,"E252"]
[null,null,null,null,294,"三井住友信託",null,null,"X",null,null,null,null,null,null,null,null,null,null,null,null,null,null,"M258"]
[null,null,null,null,297,"日本マスタートラスト信託",null,null,"Y",null,null,null,null,null,null,null,null,null,null,null,null,null,null,"P258"]
[null,null,null,null,300,"ＳＭＢＣ信託",null,null,"Z",null,null,null,null,null,null,null,null,null,null,null,null,null,null,"M264"]
[null,null,null,null,304,"野村信託",null,null,"(",null,null,null,null,null,null,null,null,null,null,null,null,null,null,"P264"]
[null,null,null,null,307,"オリックス",null,null,")",null,null,null,null,null,null,null,null,null,null,null,null,null,null,"M265"]
[null,null,null,null,310,"ＧＭＯあおぞらネット",null,null,".",null,null,null,null,null,null,null,null,null,null,null,null,null,null,"P265"]
[null,null,null,null,324,"日本カストディ",null,null,"-",null,null,null,null,null,null,null,null,null,null,null,null,null,null,"M266"]
[null,null,null,null,397,"ＳＢＩ新生",null,null,"ｰ",null,null,null,null,null,null,null,null,null,null,null,null,null,null,"P266"]
[null,null,null,null,398,"あおぞら",null,null,"/",null,null,null,null,null,null,null,null,null,null,null,null,null,null,"M287"]
[null,null,null,null,401,"シティバンク、エヌ・エイ",null,null," ",null,null,null,null,null,null,null,null,null,null,null,null,null,null,"P287"]
[null,null,null,null,402,"ジェー・ピー・モルガン・チェース・バンク・ナショナル・アソシエーション",null,null,null,null,null,null,null,null,null,null,null,null,null,null,null,null,null,"M288"]
[null,null,null,null,403,"バンク・オブ・アメリカ・エヌ・エイ",null,null,null,null,null,null,null,null,null,null,null,null,null,null,null,null,null,"P288"]
[null,null,null,null,411,"香港上海",null,null,null,null,null,null,null,null,null,null,null,null,null,null,null,null,null,"P308"]
[null,null,null,null,430,"ドイツ",null,null,null,null,null,null,null,null,null,null,null,null,null,null,null,null,null,"C311"]
[null,null,null,null,443,"ビー・エヌ・ピー・パリバ",null,null,null,null,null,null,null,null,null,null,null,null,null,null,null,null,null,"P314"]
[null,null,null,null,472,"ＳＢＪ",null,null,null,null,null,null,null,null,null,null,null,null,null,null,null,null,null,"C317"]
[null,null,null,null,489,"バンク・オブ・チャイナ",null,null,null,null,null,null,null,null,null,null,null,null,null,null,null,null,null,"M336"]
[null,null,null,null,501,"北洋",null,null,null,null,null,null,null,null,null,null,null,null,null,null,null,null,null,"P336"]
[null,null,null,null,508,"きらやか",null,null,null,null,null,null,null,null,null,null,null,null,null,null,null,null,null,"M337"]
[null,null,null,null,509,"北日本",null,null,null,null,null,null,null,null,null,null,null,null,null,null,null,null,null,"P337"]
[null,null,null,null,512,"仙台",null,null,null,null,null,null,null,null,null,null,null,null,null,null,null,null,null,"M338"]
[null,null,null,null,513,"福島",null,null,null,null,null,null,null,null,null,null,null,null,null,null,null,null,null,"P338"]
[null,null,null,null,514,"大東",null,null,null,null,null,null,null,null,null,null,null,null,null,null,null,null,null,"M339"]
[null,null,null,null,516,"東和",null,null,null,null,null,null,null,null,null,null,null,null,null,null,null,null,null,"P339"]
[null,null,null,null,517,"栃木",null,null,null,null,null,null,null,null,null,null,null,null,null,null,null,null,null,"E343"]
[null,null,null,null,522,"京葉",null,null,null,null,null,null,null,null,null,null,null,null,null,null,null,null,null,"M343"]
[null,null,null,null,525,"東日本",null,null,null,null,null,null,null,null,null,null,null,null,null,null,null,null,null,"P343"]
[null,null,null,null,526,"東京スター",null,null,null,null,null,null,null,null,null,null,null,null,null,null,null,null,null,"C345"]
[null,null,null,null,530,"神奈川",null,null,null,null,null,null,null,null,null,null,null,null,null,null,null,null,null,"E355"]
[null,null,null,null,532,"大光",null,null,null,null,null,null,null,null,null,null,null,null,null,null,null,null,null,"P355"]
[null,null,null,null,533,"長野",null,null,null,null,null,null,null,null,null,null,null,null,null,null,null,null,null,"C357"]
[null,null,null,null,534,"富山第一"]
[null,null,null,null,537,"福邦"]
[null,null,null,null,538,"静岡中央"]
[null,null,null,null,542,"愛知"]
[null,null,null,null,543,"名古屋"]
[null,null,null,null,544,"中京"]
[null,null,null,null,562,"みなと"]
[null,null,null,null,565,"島根"]
[null,null,null,null,566,"トマト"]
[null,null,null,null,569,"もみじ"]
[null,null,null,null,570,"西京"]
[null,null,null,null,572,"徳島大正"]
[null,null,null,null,573,"香川"]
[null,null,null,null,576,"愛媛"]
[null,null,null,null,578,"高知"]
[null,null,null,null,582,"福岡中央"]
[null,null,null,null,583,"佐賀共栄"]
[null,null,null,null,585,"長崎"]
[null,null,null,null,587,"熊本"]
[null,null,null,null,590,"豊和"]
[null,null,null,null,591,"宮崎太陽"]
[null,null,null,null,594,"南日本"]
[null,null,null,null,596,"沖縄海邦"]
[null,null,null,null,1000,"信金中央金庫"]
[null,null,null,null,1001,"北海道信金"]
[null,null,null,null,1003,"室蘭信金"]
[null,null,null,null,1004,"空知信金"]
[null,null,null,null,1006,"苫小牧信金"]
[null,null,null,null,1008,"北門信金"]
[null,null,null,null,1009,"伊達信金"]
[null,null,null,null,1010,"北空知信金"]
[null,null,null,null,1011,"日高信金"]
[null,null,null,null,1013,"渡島信金"]
[null,null,null,null,1014,"道南うみ街信金"]
[null,null,null,null,1020,"旭川信金"]
[null,null,null,null,1021,"稚内信金"]
[null,null,null,null,1022,"留萌信金"]
[null,null,null,null,1024,"北星信金"]
[null,null,null,null,1026,"帯広信金"]
[null,null,null,null,1027,"釧路信金"]
[null,null,null,null,1028,"大地みらい信金"]
[null,null,null,null,1030,"北見信金"]
[null,null,null,null,1031,"網走信金"]
[null,null,null,null,1033,"遠軽信金"]
[null,null,null,null,1104,"東奥信金"]
[null,null,null,null,1105,"青い森信金"]
[null,null,null,null,1120,"秋田信金"]
[null,null,null,null,1123,"羽後信金"]
[null,null,null,null,1140,"山形信金"]
[null,null,null,null,1141,"米沢信金"]
[null,null,null,null,1142,"鶴岡信金"]
[null,null,null,null,1143,"新庄信金"]
[null,null,null,null,1150,"盛岡信金"]
[null,null,null,null,1152,"宮古信金"]
[null,null,null,null,1153,"一関信金"]
[null,null,null,null,1154,"北上信金"]
[null,null,null,null,1155,"花巻信金"]
[null,null,null,null,1156,"水沢信金"]
[null,null,null,null,1170,"杜の都信金"]
[null,null,null,null,1171,"宮城第一信金"]
[null,null,null,null,1172,"石巻信金"]
[null,null,null,null,1174,"仙南信金"]
[null,null,null,null,1175,"気仙沼信金"]
[null,null,null,null,1181,"会津信金"]
[null,null,null,null,1182,"郡山信金"]
[null,null,null,null,1184,"白河信金"]
[null,null,null,null,1185,"須賀川信金"]
[null,null,null,null,1186,"ひまわり信金"]
[null,null,null,null,1188,"あぶくま信金"]
[null,null,null,null,1189,"二本松信金"]
[null,null,null,null,1190,"福島信金"]
[null,null,null,null,1203,"高崎信金"]
[null,null,null,null,1204,"桐生信金"]
[null,null,null,null,1206,"アイオー信金"]
[null,null,null,null,1208,"利根郡信金"]
[null,null,null,null,1209,"館林信金"]
[null,null,null,null,1210,"北群馬信金"]
[null,null,null,null,1211,"しののめ信金"]
[null,null,null,null,1221,"足利小山信金"]
[null,null,null,null,1222,"栃木信金"]
[null,null,null,null,1223,"鹿沼相互信金"]
[null,null,null,null,1224,"佐野信金"]
[null,null,null,null,1225,"大田原信金"]
[null,null,null,null,1227,"烏山信金"]
[null,null,null,null,1240,"水戸信金"]
[null,null,null,null,1242,"結城信金"]
[null,null,null,null,1250,"埼玉縣信金"]
[null,null,null,null,1251,"川口信金"]
[null,null,null,null,1252,"青木信金"]
[null,null,null,null,1253,"飯能信金"]
[null,null,null,null,1260,"千葉信金"]
[null,null,null,null,1261,"銚子信金"]
[null,null,null,null,1262,"東京ベイ信金"]
[null,null,null,null,1264,"館山信金"]
[null,null,null,null,1267,"佐原信金"]
[null,null,null,null,1280,"横浜信金"]
[null,null,null,null,1281,"かながわ信金"]
[null,null,null,null,1282,"湘南信金"]
[null,null,null,null,1283,"川崎信金"]
[null,null,null,null,1286,"平塚信金"]
[null,null,null,null,1288,"さがみ信金"]
[null,null,null,null,1289,"中栄信金"]
[null,null,null,null,1290,"中南信金"]
[null,null,null,null,1303,"朝日信金"]
[null,null,null,null,1305,"興産信金"]
[null,null,null,null,1310,"さわやか信金"]
[null,null,null,null,1311,"東京シティ信金"]
[null,null,null,null,1319,"芝信金"]
[null,null,null,null,1320,"東京東信金"]
[null,null,null,null,1321,"東栄信金"]
[null,null,null,null,1323,"亀有信金"]
[null,null,null,null,1326,"小松川信金"]
[null,null,null,null,1327,"足立成和信金"]
[null,null,null,null,1333,"東京三協信金"]
[null,null,null,null,1336,"西京信金"]
[null,null,null,null,1341,"西武信金"]
[null,null,null,null,1344,"城南信金"]
[null,null,null,null,1345,"昭和信金"]
[null,null,null,null,1346,"目黒信金"]
[null,null,null,null,1348,"世田谷信金"]
[null,null,null,null,1349,"東京信金"]
[null,null,null,null,1351,"城北信金"]
[null,null,null,null,1352,"瀧野川信金"]
[null,null,null,null,1356,"巣鴨信金"]
[null,null,null,null,1358,"青梅信金"]
[null,null,null,null,1360,"多摩信金"]
[null,null,null,null,1370,"新潟信金"]
[null,null,null,null,1371,"長岡信金"]
[null,null,null,null,1373,"三条信金"]
[null,null,null,null,1374,"新発田信金"]
[null,null,null,null,1375,"柏崎信金"]
[null,null,null,null,1376,"上越信金"]
[null,null,null,null,1377,"新井信金"]
[null,null,null,null,1379,"村上信金"]
[null,null,null,null,1380,"加茂信金"]
[null,null,null,null,1385,"甲府信金"]
[null,null,null,null,1386,"山梨信金"]
[null,null,null,null,1390,"長野信金"]
[null,null,null,null,1391,"松本信金"]
[null,null,null,null,1392,"上田信金"]
[null,null,null,null,1393,"諏訪信金"]
[null,null,null,null,1394,"飯田信金"]
[null,null,null,null,1396,"アルプス中央信金"]
[null,null,null,null,1401,"富山信金"]
[null,null,null,null,1402,"高岡信金"]
[null,null,null,null,1404,"新湊信金"]
[null,null,null,null,1405,"にいかわ信金"]
[null,null,null,null,1406,"氷見伏木信金"]
[null,null,null,null,1412,"砺波信金"]
[null,null,null,null,1413,"石動信金"]
[null,null,null,null,1440,"金沢信金"]
[null,null,null,null,1442,"のと共栄信金"]
[null,null,null,null,1444,"はくさん信金"]
[null,null,null,null,1448,"興能信金"]
[null,null,null,null,1470,"福井信金"]
[null,null,null,null,1471,"敦賀信金"]
[null,null,null,null,1473,"小浜信金"]
[null,null,null,null,1475,"越前信金"]
[null,null,null,null,1501,"しずおか焼津信金"]
[null,null,null,null,1502,"静清信金"]
[null,null,null,null,1503,"浜松磐田信金"]
[null,null,null,null,1505,"沼津信金"]
[null,null,null,null,1506,"三島信金"]
[null,null,null,null,1507,"富士宮信金"]
[null,null,null,null,1513,"島田掛川信金"]
[null,null,null,null,1515,"富士信金"]
[null,null,null,null,1517,"遠州信金"]
[null,null,null,null,1530,"岐阜信金"]
[null,null,null,null,1531,"大垣西濃信金"]
[null,null,null,null,1532,"高山信金"]
[null,null,null,null,1533,"東濃信金"]
[null,null,null,null,1534,"関信金"]
[null,null,null,null,1538,"八幡信金"]
[null,null,null,null,1550,"愛知信金"]
[null,null,null,null,1551,"豊橋信金"]
[null,null,null,null,1552,"岡崎信金"]
[null,null,null,null,1553,"いちい信金"]
[null,null,null,null,1554,"瀬戸信金"]
[null,null,null,null,1555,"半田信金"]
[null,null,null,null,1556,"知多信金"]
[null,null,null,null,1557,"豊川信金"]
[null,null,null,null,1559,"豊田信金"]
[null,null,null,null,1560,"碧海信金"]
[null,null,null,null,1561,"西尾信金"]
[null,null,null,null,1562,"蒲郡信金"]
[null,null,null,null,1563,"尾西信金"]
[null,null,null,null,1565,"中日信金"]
[null,null,null,null,1566,"東春信金"]
[null,null,null,null,1580,"津信金"]
[null,null,null,null,1581,"北伊勢上野信金"]
[null,null,null,null,1583,"桑名三重信金"]
[null,null,null,null,1585,"紀北信金"]
[null,null,null,null,1602,"滋賀中央信金"]
[null,null,null,null,1603,"長浜信金"]
[null,null,null,null,1604,"湖東信金"]
[null,null,null,null,1610,"京都信金"]
[null,null,null,null,1611,"京都中央信金"]
[null,null,null,null,1620,"京都北都信金"]
[null,null,null,null,1630,"大阪信金"]
[null,null,null,null,1633,"大阪厚生信金"]
[null,null,null,null,1635,"大阪シティ信金"]
[null,null,null,null,1636,"大阪商工信金"]
[null,null,null,null,1643,"永和信金"]
[null,null,null,null,1645,"北おおさか信金"]
[null,null,null,null,1656,"枚方信金"]
[null,null,null,null,1666,"奈良信金"]
[null,null,null,null,1667,"大和信金"]
[null,null,null,null,1668,"奈良中央信金"]
[null,null,null,null,1671,"新宮信金"]
[null,null,null,null,1674,"きのくに信金"]
[null,null,null,null,1680,"神戸信金"]
[null,null,null,null,1685,"姫路信金"]
[null,null,null,null,1686,"播州信金"]
[null,null,null,null,1687,"兵庫信金"]
[null,null,null,null,1688,"尼崎信金"]
[null,null,null,null,1689,"日新信金"]
[null,null,null,null,1691,"淡路信金"]
[null,null,null,null,1692,"但馬信金"]
[null,null,null,null,1694,"西兵庫信金"]
[null,null,null,null,1695,"中兵庫信金"]
[null,null,null,null,1696,"但陽信金"]
[null,null,null,null,1701,"鳥取信金"]
[null,null,null,null,1702,"米子信金"]
[null,null,null,null,1703,"倉吉信金"]
[null,null,null,null,1710,"しまね信金"]
[null,null,null,null,1711,"日本海信金"]
[null,null,null,null,1712,"島根中央信金"]
[null,null,null,null,1732,"おかやま信金"]
[null,null,null,null,1734,"水島信金"]
[null,null,null,null,1735,"津山信金"]
[null,null,null,null,1738,"玉島信金"]
[null,null,null,null,1740,"備北信金"]
[null,null,null,null,1741,"吉備信金"]
[null,null,null,null,1743,"備前日生信金"]
[null,null,null,null,1750,"広島信金"]
[null,null,null,null,1752,"呉信金"]
[null,null,null,null,1756,"しまなみ信金"]
[null,null,null,null,1758,"広島みどり信金"]
[null,null,null,null,1780,"萩山口信金"]
[null,null,null,null,1781,"西中国信金"]
[null,null,null,null,1789,"東山口信金"]
[null,null,null,null,1801,"徳島信金"]
[null,null,null,null,1803,"阿南信金"]
[null,null,null,null,1830,"高松信金"]
[null,null,null,null,1833,"観音寺信金"]
[null,null,null,null,1860,"愛媛信金"]
[null,null,null,null,1862,"宇和島信金"]
[null,null,null,null,1864,"東予信金"]
[null,null,null,null,1866,"川之江信金"]
[null,null,null,null,1880,"幡多信金"]
[null,null,null,null,1881,"高知信金"]
[null,null,null,null,1901,"福岡信金"]
[null,null,null,null,1903,"福岡ひびき信金"]
[null,null,null,null,1908,"大牟田柳川信金"]
[null,null,null,null,1909,"筑後信金"]
[null,null,null,null,1910,"飯塚信金"]
[null,null,null,null,1913,"田川信金"]
[null,null,null,null,1917,"大川信金"]
[null,null,null,null,1920,"遠賀信金"]
[null,null,null,null,1930,"唐津信金"]
[null,null,null,null,1931,"佐賀信金"]
[null,null,null,null,1932,"伊万里信金"]
[null,null,null,null,1933,"九州ひぜん信金"]
[null,null,null,null,1942,"たちばな信金"]
[null,null,null,null,1951,"熊本信金"]
[null,null,null,null,1952,"熊本第一信金"]
[null,null,null,null,1954,"熊本中央信金"]
[null,null,null,null,1955,"天草信金"]
[null,null,null,null,1960,"大分信金"]
[null,null,null,null,1962,"大分みらい信金"]
[null,null,null,null,1968,"日田信金"]
[null,null,null,null,1980,"宮崎第一信金"]
[null,null,null,null,1982,"延岡信金"]
[null,null,null,null,1985,"高鍋信金"]
[null,null,null,null,1990,"鹿児島信金"]
[null,null,null,null,1991,"鹿児島相互信金"]
[null,null,null,null,1993,"奄美大島信金"]
[null,null,null,null,1996,"コザ信金"]
[null,null,null,null,2004,"商工組合中央金庫"]
[null,null,null,null,2010,"全国信用協同組合連合会"]
[null,null,null,null,2011,"北央信組"]
[null,null,null,null,2013,"札幌中央信組"]
[null,null,null,null,2014,"ウリ信組"]
[null,null,null,null,2017,"函館商工信組"]
[null,null,null,null,2019,"空知商工信組"]
[null,null,null,null,2024,"十勝信組"]
[null,null,null,null,2025,"釧路信組"]
[null,null,null,null,2030,"青森県信組"]
[null,null,null,null,2045,"杜陵信組"]
[null,null,null,null,2049,"岩手県医師信組"]
[null,null,null,null,2060,"あすか信組"]
[null,null,null,null,2061,"石巻商工信組"]
[null,null,null,null,2062,"古川信組"]
[null,null,null,null,2063,"仙北信組"]
[null,null,null,null,2075,"秋田県信組"]
[null,null,null,null,2083,"北郡信組"]
[null,null,null,null,2084,"山形中央信組"]
[null,null,null,null,2085,"山形第一信組"]
[null,null,null,null,2090,"福島県商工信組"]
[null,null,null,null,2092,"いわき信組"]
[null,null,null,null,2095,"相双五城信組"]
[null,null,null,null,2096,"会津商工信組"]
[null,null,null,null,2101,"茨城県信組"]
[null,null,null,null,2122,"真岡信組"]
[null,null,null,null,2125,"那須信組"]
[null,null,null,null,2143,"あかぎ信組"]
[null,null,null,null,2146,"群馬県信組"]
[null,null,null,null,2149,"ぐんまみらい信組"]
[null,null,null,null,2151,"群馬県医師信組"]
[null,null,null,null,2162,"埼玉県医師信組"]
[null,null,null,null,2165,"熊谷商工信組"]
[null,null,null,null,2167,"埼玉信組"]
[null,null,null,null,2180,"房総信組"]
[null,null,null,null,2184,"銚子商工信組"]
[null,null,null,null,2190,"君津信組"]
[null,null,null,null,2202,"全東栄信組"]
[null,null,null,null,2210,"東浴信組"]
[null,null,null,null,2211,"文化産業信組"]
[null,null,null,null,2213,"整理回収機構"]
[null,null,null,null,2215,"東京証券信組"]
[null,null,null,null,2224,"東京厚生信組"]
[null,null,null,null,2226,"東信組"]
[null,null,null,null,2229,"江東信組"]
[null,null,null,null,2231,"青和信組"]
[null,null,null,null,2235,"中ノ郷信組"]
[null,null,null,null,2241,"共立信組"]
[null,null,null,null,2243,"七島信組"]
[null,null,null,null,2248,"大東京信組"]
[null,null,null,null,2254,"第一勧業信組"]
[null,null,null,null,2271,"警視庁職員信組"]
[null,null,null,null,2274,"東京消防信組"]
[null,null,null,null,2276,"東京都職員信組"]
[null,null,null,null,2277,"ハナ信組"]
[null,null,null,null,2304,"神奈川県医師信組"]
[null,null,null,null,2305,"神奈川県歯科医師信組"]
[null,null,null,null,2306,"横浜幸銀信組"]
[null,null,null,null,2307,"横浜華銀信組"]
[null,null,null,null,2315,"小田原第一信組"]
[null,null,null,null,2318,"相愛信組"]
[null,null,null,null,2332,"静岡県医師信組"]
[null,null,null,null,2351,"新潟縣信組"]
[null,null,null,null,2354,"新潟鉄道信組"]
[null,null,null,null,2356,"興栄信組"]
[null,null,null,null,2357,"はばたき信組"]
[null,null,null,null,2360,"協栄信組"]
[null,null,null,null,2361,"三條信組"]
[null,null,null,null,2362,"巻信組"]
[null,null,null,null,2363,"新潟大栄信組"]
[null,null,null,null,2365,"塩沢信組"]
[null,null,null,null,2366,"糸魚川信組"]
[null,null,null,null,2377,"山梨県民信組"]
[null,null,null,null,2378,"都留信組"]
[null,null,null,null,2390,"長野県信組"]
[null,null,null,null,2402,"富山県医師信組"]
[null,null,null,null,2404,"富山県信組"]
[null,null,null,null,2411,"金沢中央信組"]
[null,null,null,null,2417,"石川県医師信組"]
[null,null,null,null,2430,"福泉信組"]
[null,null,null,null,2435,"福井県医師信組"]
[null,null,null,null,2440,"丸八信組"]
[null,null,null,null,2442,"愛知商銀信組"]
[null,null,null,null,2443,"愛知県警察信組"]
[null,null,null,null,2444,"名古屋青果物信組"]
[null,null,null,null,2446,"愛知県医療信組"]
[null,null,null,null,2447,"愛知県医師信組"]
[null,null,null,null,2448,"豊橋商工信組"]
[null,null,null,null,2451,"愛知県中央信組"]
[null,null,null,null,2470,"岐阜商工信組"]
[null,null,null,null,2471,"イオ信組"]
[null,null,null,null,2473,"岐阜県医師信組"]
[null,null,null,null,2476,"飛騨信組"]
[null,null,null,null,2481,"益田信組"]
[null,null,null,null,2504,"滋賀県民信組"]
[null,null,null,null,2505,"滋賀県信組"]
[null,null,null,null,2526,"京滋信組"]
[null,null,null,null,2540,"大同信組"]
[null,null,null,null,2541,"成協信組"]
[null,null,null,null,2543,"大阪協栄信組"]
[null,null,null,null,2548,"大阪貯蓄信組"]
[null,null,null,null,2549,"のぞみ信組"]
[null,null,null,null,2556,"中央信組"]
[null,null,null,null,2560,"大阪府医師信組"]
[null,null,null,null,2566,"大阪府警察信組"]
[null,null,null,null,2567,"近畿産業信組"]
[null,null,null,null,2580,"朝日新聞信組"]
[null,null,null,null,2581,"毎日信組"]
[null,null,null,null,2582,"ミレ信組"]
[null,null,null,null,2602,"兵庫県警察信組"]
[null,null,null,null,2605,"兵庫県医療信組"]
[null,null,null,null,2606,"兵庫県信組"]
[null,null,null,null,2610,"神戸市職員信組"]
[null,null,null,null,2616,"淡陽信組"]
[null,null,null,null,2620,"兵庫ひまわり信組"]
[null,null,null,null,2634,"和歌山県医師信組"]
[null,null,null,null,2661,"島根益田信組"]
[null,null,null,null,2672,"朝銀西信組"]
[null,null,null,null,2674,"笠岡信組"]
[null,null,null,null,2680,"広島市信組"]
[null,null,null,null,2681,"広島県信組"]
[null,null,null,null,2684,"広島商銀信組"]
[null,null,null,null,2690,"両備信組"]
[null,null,null,null,2696,"備後信組"]
[null,null,null,null,2703,"山口県信組"]
[null,null,null,null,2721,"香川県信組"]
[null,null,null,null,2740,"土佐信組"]
[null,null,null,null,2741,"宿毛商銀信組"]
[null,null,null,null,2751,"福岡県庁信組"]
[null,null,null,null,2753,"福岡県医師信組"]
[null,null,null,null,2773,"福岡県信組"]
[null,null,null,null,2802,"佐賀県医師信組"]
[null,null,null,null,2803,"佐賀東信組"]
[null,null,null,null,2808,"佐賀西信組"]
[null,null,null,null,2820,"長崎三菱信組"]
[null,null,null,null,2821,"長崎県医師信組"]
[null,null,null,null,2825,"西海みずき信組"]
[null,null,null,null,2833,"福江信組"]
[null,null,null,null,2842,"熊本県医師信組"]
[null,null,null,null,2845,"熊本県信組"]
[null,null,null,null,2870,"大分県信組"]
[null,null,null,null,2884,"宮崎県南部信組"]
[null,null,null,null,2890,"鹿児島興業信組"]
[null,null,null,null,2891,"鹿児島県医師信組"]
[null,null,null,null,2895,"奄美信組"]
[null,null,null,null,2950,"労働金庫連合会"]
[null,null,null,null,2951,"北海道労金"]
[null,null,null,null,2954,"東北労金"]
[null,null,null,null,2963,"中央労金"]
[null,null,null,null,2965,"新潟県労金"]
[null,null,null,null,2966,"長野県労金"]
[null,null,null,null,2968,"静岡県労金"]
[null,null,null,null,2970,"北陸労金"]
[null,null,null,null,2972,"東海労金"]
[null,null,null,null,2978,"近畿労金"]
[null,null,null,null,2984,"中国労金"]
[null,null,null,null,2987,"四国労金"]
[null,null,null,null,2990,"九州労金"]
[null,null,null,null,2997,"沖縄県労金"]
[null,null,null,null,3000,"農林中央金庫"]
[null,null,null,null,3001,"北海道信連"]
[null,null,null,null,3003,"岩手県信連"]
[null,null,null,null,3008,"茨城県信連"]
[null,null,null,null,3011,"埼玉県信連"]
[null,null,null,null,3013,"東京都信連"]
[null,null,null,null,3014,"神奈川県信連"]
[null,null,null,null,3015,"山梨県信連"]
[null,null,null,null,3016,"長野県信連"]
[null,null,null,null,3017,"新潟県信連"]
[null,null,null,null,3019,"石川県信連"]
[null,null,null,null,3020,"岐阜県信連"]
[null,null,null,null,3021,"静岡県信連"]
[null,null,null,null,3022,"愛知県信連"]
[null,null,null,null,3023,"三重県信連"]
[null,null,null,null,3024,"福井県信連"]
[null,null,null,null,3025,"滋賀県信連"]
[null,null,null,null,3026,"京都府信連"]
[null,null,null,null,3027,"大阪府信連"]
[null,null,null,null,3028,"兵庫県信連"]
[null,null,null,null,3030,"和歌山県信連"]
[null,null,null,null,3031,"鳥取県信連"]
[null,null,null,null,3034,"広島県信連"]
[null,null,null,null,3035,"山口県信連"]
[null,null,null,null,3036,"徳島県信連"]
[null,null,null,null,3037,"香川県信連"]
[null,null,null,null,3038,"愛媛県信連"]
[null,null,null,null,3039,"高知県信連"]
[null,null,null,null,3040,"福岡県信連"]
[null,null,null,null,3041,"佐賀県信連"]
[null,null,null,null,3044,"大分県信連"]
[null,null,null,null,3045,"宮崎県信連"]
[null,null,null,null,3046,"鹿児島県信連"]
[null,null,null,null,3058,"今金町農協"]
[null,null,null,null,3066,"函館市亀田農協"]
[null,null,null,null,3068,"新函館農協"]
[null,null,null,null,3086,"ようてい農協"]
[null,null,null,null,3087,"きょうわ農協"]
[null,null,null,null,3094,"新おたる農協"]
[null,null,null,null,3095,"余市町農協"]
[null,null,null,null,3103,"とうや湖農協"]
[null,null,null,null,3107,"伊達市農協"]
[null,null,null,null,3112,"とまこまい広域農協"]
[null,null,null,null,3114,"鵡川農協"]
[null,null,null,null,3120,"びらとり農協"]
[null,null,null,null,3122,"門別町農協"]
[null,null,null,null,3126,"みついし農協"]
[null,null,null,null,3133,"札幌市農協"]
[null,null,null,null,3139,"道央農協"]
[null,null,null,null,3142,"石狩市農協"]
[null,null,null,null,3145,"北石狩農協"]
[null,null,null,null,3147,"新篠津村農協"]
[null,null,null,null,3154,"サツラク農協"]
[null,null,null,null,3156,"いわみざわ農協"]
[null,null,null,null,3161,"南幌町農協"]
[null,null,null,null,3164,"美唄市農協"]
[null,null,null,null,3165,"峰延農協"]
[null,null,null,null,3168,"月形町農協"]
[null,null,null,null,3170,"ながぬま農協"]
[null,null,null,null,3172,"そらち南農協"]
[null,null,null,null,3173,"夕張市農協"]
[null,null,null,null,3175,"新砂川農協"]
[null,null,null,null,3177,"たきかわ農協"]
[null,null,null,null,3181,"ピンネ農協"]
[null,null,null,null,3188,"北いぶき農協"]
[null,null,null,null,3189,"きたそらち農協"]
[null,null,null,null,3202,"るもい農協"]
[null,null,null,null,3208,"幌延町農協"]
[null,null,null,null,3210,"あさひかわ農協"]
[null,null,null,null,3214,"たいせつ農協"]
[null,null,null,null,3219,"東神楽農協"]
[null,null,null,null,3220,"東旭川農協"]
[null,null,null,null,3223,"当麻農協"]
[null,null,null,null,3224,"比布町農協"]
[null,null,null,null,3225,"上川中央農協"]
[null,null,null,null,3227,"東川町農協"]
[null,null,null,null,3228,"美瑛町農協"]
[null,null,null,null,3231,"ふらの農協"]
[null,null,null,null,3238,"北ひびき農協"]
[null,null,null,null,3244,"道北なよろ農協"]
[null,null,null,null,3248,"北はるか農協"]
[null,null,null,null,3257,"北宗谷農協"]
[null,null,null,null,3259,"東宗谷農協"]
[null,null,null,null,3261,"宗谷南農協"]
[null,null,null,null,3264,"帯広市川西農協"]
[null,null,null,null,3265,"帯広大正農協"]
[null,null,null,null,3266,"中札内村農協"]
[null,null,null,null,3267,"更別村農協"]
[null,null,null,null,3268,"忠類農協"]
[null,null,null,null,3269,"大樹町農協"]
[null,null,null,null,3270,"広尾町農協"]
[null,null,null,null,3271,"芽室町農協"]
[null,null,null,null,3273,"十勝清水町農協"]
[null,null,null,null,3275,"新得町農協"]
[null,null,null,null,3276,"鹿追町農協"]
[null,null,null,null,3277,"木野農協"]
[null,null,null,null,3278,"音更町農協"]
[null,null,null,null,3279,"士幌町農協"]
[null,null,null,null,3280,"上士幌町農協"]
[null,null,null,null,3281,"札内農協"]
[null,null,null,null,3282,"幕別町農協"]
[null,null,null,null,3283,"十勝池田町農協"]
[null,null,null,null,3286,"豊頃町農協"]
[null,null,null,null,3287,"浦幌町農協"]
[null,null,null,null,3288,"本別町農協"]
[null,null,null,null,3289,"足寄町農協"]
[null,null,null,null,3290,"陸別町農協"]
[null,null,null,null,3297,"北オホーツク農協"]
[null,null,null,null,3301,"オホーツクはまなす農協"]
[null,null,null,null,3303,"佐呂間町農協"]
[null,null,null,null,3305,"湧別町農協"]
[null,null,null,null,3306,"えんゆう農協"]
[null,null,null,null,3317,"きたみらい農協"]
[null,null,null,null,3319,"津別町農協"]
[null,null,null,null,3320,"美幌町農協"]
[null,null,null,null,3321,"女満別町農協"]
[null,null,null,null,3322,"常呂町農協"]
[null,null,null,null,3326,"オホーツク網走農協"]
[null,null,null,null,3328,"小清水町農協"]
[null,null,null,null,3329,"しれとこ斜里農協"]
[null,null,null,null,3330,"清里町農協"]
[null,null,null,null,3334,"釧路太田農協"]
[null,null,null,null,3335,"浜中町農協"]
[null,null,null,null,3336,"標茶町農協"]
[null,null,null,null,3337,"摩周湖農協"]
[null,null,null,null,3338,"阿寒農協"]
[null,null,null,null,3339,"釧路丹頂農協"]
[null,null,null,null,3348,"標津町農協"]
[null,null,null,null,3349,"中標津町農協"]
[null,null,null,null,3350,"計根別農協"]
[null,null,null,null,3354,"道東あさひ農協"]
[null,null,null,null,3358,"中春別農協"]
[null,null,null,null,3373,"青森農協"]
[null,null,null,null,3387,"つがる弘前農協"]
[null,null,null,null,3390,"相馬村農協"]
[null,null,null,null,3407,"津軽みらい農協"]
[null,null,null,null,3421,"つがるにしきた農協"]
[null,null,null,null,3442,"ごしょつがる農協"]
[null,null,null,null,3455,"十和田おいらせ農協"]
[null,null,null,null,3469,"ゆうき青森農協"]
[null,null,null,null,3474,"おいらせ農協"]
[null,null,null,null,3488,"八戸農協"]
[null,null,null,null,3517,"新岩手農協"]
[null,null,null,null,3541,"岩手中央農協"]
[null,null,null,null,3553,"花巻農協"]
[null,null,null,null,3572,"岩手ふるさと農協"]
[null,null,null,null,3579,"岩手江刺農協"]
[null,null,null,null,3590,"いわて平泉農協"]
[null,null,null,null,3598,"大船渡市農協"]
[null,null,null,null,3636,"仙台農協"]
[null,null,null,null,3647,"岩沼市農協"]
[null,null,null,null,3652,"名取岩沼農協"]
[null,null,null,null,3653,"みやぎ亘理農協"]
[null,null,null,null,3665,"みやぎ登米農協"]
[null,null,null,null,3704,"古川農協"]
[null,null,null,null,3710,"加美よつば農協"]
[null,null,null,null,3721,"新みやぎ農協"]
[null,null,null,null,3731,"いしのまき農協"]
[null,null,null,null,3751,"みやぎ仙南農協"]
[null,null,null,null,3762,"かづの農協"]
[null,null,null,null,3764,"あきた北農協"]
[null,null,null,null,3771,"秋田たかのす農協"]
[null,null,null,null,3784,"あきた白神農協"]
[null,null,null,null,3795,"秋田やまもと農協"]
[null,null,null,null,3798,"あきた湖東農協"]
[null,null,null,null,3810,"秋田なまはげ農協"]
[null,null,null,null,3825,"秋田しんせい農協"]
[null,null,null,null,3855,"秋田おばこ農協"]
[null,null,null,null,3878,"秋田ふるさと農協"]
[null,null,null,null,3913,"こまち農協"]
[null,null,null,null,3917,"うご農協"]
[null,null,null,null,3929,"大潟村農協"]
[null,null,null,null,3931,"山形市農協"]
[null,null,null,null,3932,"山形農協"]
[null,null,null,null,3938,"天童市農協"]
[null,null,null,null,3943,"さがえ西村山農協"]
[null,null,null,null,3960,"みちのく村山農協"]
[null,null,null,null,3962,"東根市農協"]
[null,null,null,null,3971,"新庄市農協"]
[null,null,null,null,3973,"もがみ中央農協"]
[null,null,null,null,3987,"金山農協"]
[null,null,null,null,3989,"山形おきたま農協"]
[null,null,null,null,4000,"鶴岡市農協"]
[null,null,null,null,4013,"庄内たがわ農協"]
[null,null,null,null,4022,"余目町農協"]
[null,null,null,null,4027,"庄内みどり農協"]
[null,null,null,null,4036,"酒田市袖浦農協"]
[null,null,null,null,4047,"ふくしま未来農協"]
[null,null,null,null,4091,"夢みなみ農協"]
[null,null,null,null,4132,"東西しらかわ農協"]
[null,null,null,null,4160,"会津よつば農協"]
[null,null,null,null,4196,"福島さくら農協"]
[null,null,null,null,4238,"水戸農協"]
[null,null,null,null,4263,"常陸農協"]
[null,null,null,null,4294,"日立市多賀農協"]
[null,null,null,null,4295,"茨城旭村農協"]
[null,null,null,null,4296,"ほこた農協"]
[null,null,null,null,4301,"なめがたしおさい農協"]
[null,null,null,null,4322,"稲敷農協"]
[null,null,null,null,4344,"水郷つくば農協"]
[null,null,null,null,4363,"つくば市農協"]
[null,null,null,null,4371,"つくば市谷田部農協"]
[null,null,null,null,4378,"茨城みなみ農協"]
[null,null,null,null,4387,"やさと農協"]
[null,null,null,null,4394,"新ひたち野農協"]
[null,null,null,null,4397,"北つくば農協"]
[null,null,null,null,4413,"常総ひかり農協"]
[null,null,null,null,4422,"茨城むつみ農協"]
[null,null,null,null,4425,"岩井農協"]
[null,null,null,null,4445,"宇都宮農協"]
[null,null,null,null,4456,"上都賀農協"]
[null,null,null,null,4463,"はが野農協"]
[null,null,null,null,4478,"下野農協"]
[null,null,null,null,4490,"小山農協"]
[null,null,null,null,4497,"塩野谷農協"]
[null,null,null,null,4507,"那須野農協"]
[null,null,null,null,4518,"那須南農協"]
[null,null,null,null,4523,"佐野農協"]
[null,null,null,null,4533,"足利市農協"]
[null,null,null,null,4540,"赤城橘農協"]
[null,null,null,null,4544,"前橋市農協"]
[null,null,null,null,4563,"高崎市農協"]
[null,null,null,null,4567,"はぐくみ農協"]
[null,null,null,null,4593,"北群渋川農協"]
[null,null,null,null,4594,"多野藤岡農協"]
[null,null,null,null,4608,"甘楽富岡農協"]
[null,null,null,null,4613,"碓氷安中農協"]
[null,null,null,null,4626,"あがつま農協"]
[null,null,null,null,4628,"嬬恋村農協"]
[null,null,null,null,4632,"利根沼田農協"]
[null,null,null,null,4652,"佐波伊勢崎農協"]
[null,null,null,null,4664,"新田みどり農協"]
[null,null,null,null,4665,"太田市農協"]
[null,null,null,null,4677,"邑楽館林農協"]
[null,null,null,null,4682,"さいたま農協"]
[null,null,null,null,4730,"あさか野農協"]
[null,null,null,null,4735,"いるま野農協"]
[null,null,null,null,4780,"埼玉中央農協"]
[null,null,null,null,4792,"ちちぶ農協"]
[null,null,null,null,4802,"埼玉ひびきの農協"]
[null,null,null,null,4808,"くまがや農協"]
[null,null,null,null,4820,"埼玉岡部農協"]
[null,null,null,null,4823,"花園農協"]
[null,null,null,null,4828,"ほくさい農協"]
[null,null,null,null,4847,"越谷市農協"]
[null,null,null,null,4848,"南彩農協"]
[null,null,null,null,4859,"埼玉みずほ農協"]
[null,null,null,null,4864,"さいかつ農協"]
[null,null,null,null,4874,"ふかや農協"]
[null,null,null,null,4876,"安房農協"]
[null,null,null,null,4893,"いすみ農協"]
[null,null,null,null,4902,"木更津市農協"]
[null,null,null,null,4909,"君津市農協"]
[null,null,null,null,4916,"長生農協"]
[null,null,null,null,4929,"山武郡市農協"]
[null,null,null,null,4949,"市原市農協"]
[null,null,null,null,4954,"千葉みらい農協"]
[null,null,null,null,4955,"八千代市農協"]
[null,null,null,null,4959,"市川市農協"]
[null,null,null,null,4965,"とうかつ中央農協"]
[null,null,null,null,4975,"ちば東葛農協"]
[null,null,null,null,4992,"成田市農協"]
[null,null,null,null,4993,"富里市農協"]
[null,null,null,null,4996,"西印旛農協"]
[null,null,null,null,5000,"かとり農協"]
[null,null,null,null,5016,"ちばみどり農協"]
[null,null,null,null,5030,"西東京農協"]
[null,null,null,null,5037,"西多摩農協"]
[null,null,null,null,5039,"秋川農協"]
[null,null,null,null,5050,"八王子市農協"]
[null,null,null,null,5055,"東京南農協"]
[null,null,null,null,5060,"町田市農協"]
[null,null,null,null,5070,"マインズ農協"]
[null,null,null,null,5072,"東京みどり農協"]
[null,null,null,null,5077,"東京みらい農協"]
[null,null,null,null,5087,"東京むさし農協"]
[null,null,null,null,5094,"東京中央農協"]
[null,null,null,null,5095,"世田谷目黒農協"]
[null,null,null,null,5097,"東京あおば農協"]
[null,null,null,null,5100,"東京スマイル農協"]
[null,null,null,null,5114,"横浜農協"]
[null,null,null,null,5123,"セレサ川崎農協"]
[null,null,null,null,5128,"よこすか葉山農協"]
[null,null,null,null,5130,"三浦市農協"]
[null,null,null,null,5131,"さがみ農協"]
[null,null,null,null,5137,"湘南農協"]
[null,null,null,null,5140,"秦野市農協"]
[null,null,null,null,5147,"かながわ西湘農協"]
[null,null,null,null,5152,"厚木市農協"]
[null,null,null,null,5153,"県央愛川農協"]
[null,null,null,null,5159,"相模原市農協"]
[null,null,null,null,5162,"神奈川つくい農協"]
[null,null,null,null,5169,"フルーツ山梨農協"]
[null,null,null,null,5199,"笛吹農協"]
[null,null,null,null,5207,"山梨みらい農協"]
[null,null,null,null,5243,"南アルプス市農協"]
[null,null,null,null,5260,"梨北農協"]
[null,null,null,null,5272,"クレイン農協"]
[null,null,null,null,5284,"北富士農協"]
[null,null,null,null,5287,"鳴沢村農協"]
[null,null,null,null,5311,"長野八ヶ岳農協"]
[null,null,null,null,5335,"佐久浅間農協"]
[null,null,null,null,5348,"信州うえだ農協"]
[null,null,null,null,5372,"信州諏訪農協"]
[null,null,null,null,5384,"上伊那農協"]
[null,null,null,null,5405,"みなみ信州農協"]
[null,null,null,null,5441,"木曽農協"]
[null,null,null,null,5448,"松本ハイランド農協"]
[null,null,null,null,5462,"洗馬農協"]
[null,null,null,null,5466,"あづみ農協"]
[null,null,null,null,5470,"大北農協"]
[null,null,null,null,5477,"グリーン長野農協"]
[null,null,null,null,5491,"中野市農協"]
[null,null,null,null,5499,"ながの農協"]
[null,null,null,null,5554,"北越後農協"]
[null,null,null,null,5568,"胎内市農協"]
[null,null,null,null,5600,"新潟かがやき農協"]
[null,null,null,null,5666,"えちご中越農協"]
[null,null,null,null,5690,"越後おぢや農協"]
[null,null,null,null,5693,"北魚沼農協"]
[null,null,null,null,5707,"みなみ魚沼農協"]
[null,null,null,null,5714,"十日町農協"]
[null,null,null,null,5719,"津南町農協"]
[null,null,null,null,5768,"えちご上越農協"]
[null,null,null,null,5797,"ひすい農協"]
[null,null,null,null,5815,"かみはやし農協"]
[null,null,null,null,5823,"にいがた岩船農協"]
[null,null,null,null,5832,"佐渡農協"]
[null,null,null,null,5847,"羽茂農協"]
[null,null,null,null,5864,"新潟市農協"]
[null,null,null,null,5877,"みな穂農協"]
[null,null,null,null,5883,"黒部市農協"]
[null,null,null,null,5885,"魚津市農協"]
[null,null,null,null,5888,"アルプス農協"]
[null,null,null,null,5895,"あおば農協"]
[null,null,null,null,5897,"富山市農協"]
[null,null,null,null,5898,"なのはな農協"]
[null,null,null,null,5911,"いみず野農協"]
[null,null,null,null,5916,"高岡市農協"]
[null,null,null,null,5920,"氷見市農協"]
[null,null,null,null,5921,"となみ野農協"]
[null,null,null,null,5927,"なんと農協"]
[null,null,null,null,5932,"いなば農協"]
[null,null,null,null,5935,"福光農協"]
[null,null,null,null,5943,"加賀農協"]
[null,null,null,null,5962,"小松市農協"]
[null,null,null,null,5980,"根上農協"]
[null,null,null,null,5982,"能美農協"]
[null,null,null,null,5997,"松任市農協"]
[null,null,null,null,6010,"野々市農協"]
[null,null,null,null,6012,"白山農協"]
[null,null,null,null,6024,"金沢中央農協"]
[null,null,null,null,6025,"金沢市農協"]
[null,null,null,null,6062,"石川かほく農協"]
[null,null,null,null,6076,"はくい農協"]
[null,null,null,null,6084,"志賀農協"]
[null,null,null,null,6094,"能登わかば農協"]
[null,null,null,null,6113,"おおぞら農協"]
[null,null,null,null,6121,"内浦町農協"]
[null,null,null,null,6122,"珠洲市農協"]
[null,null,null,null,6129,"ぎふ農協"]
[null,null,null,null,6175,"西美濃農協"]
[null,null,null,null,6198,"いび川農協"]
[null,null,null,null,6242,"めぐみの農協"]
[null,null,null,null,6265,"陶都信用農協"]
[null,null,null,null,6287,"東美濃農協"]
[null,null,null,null,6313,"飛騨農協"]
[null,null,null,null,6345,"富士伊豆農協"]
[null,null,null,null,6363,"清水農協"]
[null,null,null,null,6373,"静岡市農協"]
[null,null,null,null,6377,"大井川農協"]
[null,null,null,null,6382,"ハイナン農協"]
[null,null,null,null,6386,"掛川市農協"]
[null,null,null,null,6387,"遠州夢咲農協"]
[null,null,null,null,6391,"遠州中央農協"]
[null,null,null,null,6403,"とぴあ浜松農協"]
[null,null,null,null,6423,"三ヶ日町農協"]
[null,null,null,null,6430,"なごや農協"]
[null,null,null,null,6436,"天白信用農協"]
[null,null,null,null,6443,"緑信用農協"]
[null,null,null,null,6451,"尾張中央農協"]
[null,null,null,null,6456,"西春日井農協"]
[null,null,null,null,6466,"あいち尾東農協"]
[null,null,null,null,6470,"愛知北農協"]
[null,null,null,null,6483,"愛知西農協"]
[null,null,null,null,6503,"海部東農協"]
[null,null,null,null,6514,"あいち海部農協"]
[null,null,null,null,6531,"あいち知多農協"]
[null,null,null,null,6552,"あいち中央農協"]
[null,null,null,null,6560,"西三河農協"]
[null,null,null,null,6572,"あいち三河農協"]
[null,null,null,null,6582,"あいち豊田農協"]
[null,null,null,null,6591,"愛知東農協"]
[null,null,null,null,6606,"蒲郡市農協"]
[null,null,null,null,6612,"ひまわり農協"]
[null,null,null,null,6615,"愛知みなみ農協"]
[null,null,null,null,6618,"豊橋農協"]
[null,null,null,null,6649,"三重北農協"]
[null,null,null,null,6665,"鈴鹿農協"]
[null,null,null,null,6673,"津安芸農協"]
[null,null,null,null,6677,"みえなか農協"]
[null,null,null,null,6697,"多気郡農協"]
[null,null,null,null,6731,"伊勢農協"]
[null,null,null,null,6758,"伊賀ふるさと農協"]
[null,null,null,null,6785,"福井県農協"]
[null,null,null,null,6853,"越前たけふ農協"]
[null,null,null,null,6874,"レーク滋賀農協"]
[null,null,null,null,6889,"甲賀農協"]
[null,null,null,null,6897,"グリーン近江農協"]
[null,null,null,null,6900,"滋賀蒲生町農協"]
[null,null,null,null,6909,"東能登川農協"]
[null,null,null,null,6911,"湖東農協"]
[null,null,null,null,6912,"東びわこ農協"]
[null,null,null,null,6919,"レーク伊吹農協"]
[null,null,null,null,6924,"北びわこ農協"]
[null,null,null,null,6941,"京都市農協"]
[null,null,null,null,6956,"京都中央農協"]
[null,null,null,null,6961,"京都やましろ農協"]
[null,null,null,null,6990,"京都農協"]
[null,null,null,null,6996,"京都丹の国農協"]
[null,null,null,null,7025,"北大阪農協"]
[null,null,null,null,7029,"高槻市農協"]
[null,null,null,null,7032,"茨木市農協"]
[null,null,null,null,7041,"大阪北部農協"]
[null,null,null,null,7087,"大阪泉州農協"]
[null,null,null,null,7092,"いずみの農協"]
[null,null,null,null,7111,"堺市農協"]
[null,null,null,null,7139,"大阪南農協"]
[null,null,null,null,7156,"グリーン大阪農協"]
[null,null,null,null,7164,"大阪中河内農協"]
[null,null,null,null,7184,"大阪東部農協"]
[null,null,null,null,7191,"九個荘農協"]
[null,null,null,null,7193,"北河内農協"]
[null,null,null,null,7200,"大阪市農協"]
[null,null,null,null,7213,"兵庫六甲農協"]
[null,null,null,null,7239,"あかし農協"]
[null,null,null,null,7240,"兵庫南農協"]
[null,null,null,null,7249,"みのり農協"]
[null,null,null,null,7264,"兵庫みらい農協"]
[null,null,null,null,7274,"加古川市南農協"]
[null,null,null,null,7288,"兵庫西農協"]
[null,null,null,null,7316,"相生市農協"]
[null,null,null,null,7326,"ハリマ農協"]
[null,null,null,null,7338,"たじま農協"]
[null,null,null,null,7353,"丹波ひかみ農協"]
[null,null,null,null,7362,"丹波ささやま農協"]
[null,null,null,null,7363,"淡路日の出農協"]
[null,null,null,null,7373,"あわじ島農協"]
[null,null,null,null,7387,"奈良県農協"]
[null,null,null,null,7532,"わかやま農協"]
[null,null,null,null,7541,"ながみね農協"]
[null,null,null,null,7543,"紀の里農協"]
[null,null,null,null,7550,"紀北川上農協"]
[null,null,null,null,7559,"ありだ農協"]
[null,null,null,null,7565,"紀州農協"]
[null,null,null,null,7576,"紀南農協"]
[null,null,null,null,7591,"みくまの農協"]
[null,null,null,null,7601,"鳥取いなば農協"]
[null,null,null,null,7625,"鳥取中央農協"]
[null,null,null,null,7641,"鳥取西部農協"]
[null,null,null,null,7708,"島根県農協"]
[null,null,null,null,7755,"岡山市農協"]
[null,null,null,null,7837,"晴れの国岡山農協"]
[null,null,null,null,7909,"広島市農協"]
[null,null,null,null,7913,"呉農協"]
[null,null,null,null,7916,"安芸農協"]
[null,null,null,null,7938,"佐伯中央農協"]
[null,null,null,null,7981,"広島北部農協"]
[null,null,null,null,7994,"広島中央農協"]
[null,null,null,null,8011,"芸南農協"]
[null,null,null,null,8019,"広島ゆたか農協"]
[null,null,null,null,8027,"三原農協"]
[null,null,null,null,8029,"尾道市農協"]
[null,null,null,null,8047,"福山市農協"]
[null,null,null,null,8069,"三次農協"]
[null,null,null,null,8076,"庄原農協"]
[null,null,null,null,8134,"山口県農協"]
[null,null,null,null,8231,"徳島市農協"]
[null,null,null,null,8234,"東とくしま農協"]
[null,null,null,null,8242,"名西郡農協"]
[null,null,null,null,8252,"板野郡農協"]
[null,null,null,null,8257,"徳島北農協"]
[null,null,null,null,8261,"大津松茂農協"]
[null,null,null,null,8263,"里浦農協"]
[null,null,null,null,8268,"阿南農協"]
[null,null,null,null,8288,"かいふ農協"]
[null,null,null,null,8296,"阿波市農協"]
[null,null,null,null,8305,"麻植郡農協"]
[null,null,null,null,8312,"美馬農協"]
[null,null,null,null,8323,"阿波みよし農協"]
[null,null,null,null,8332,"香川県農協"]
[null,null,null,null,8389,"うま農協"]
[null,null,null,null,8397,"えひめ未来農協"]
[null,null,null,null,8398,"周桑農協"]
[null,null,null,null,8400,"越智今治農協"]
[null,null,null,null,8401,"今治立花農協"]
[null,null,null,null,8425,"松山市農協"]
[null,null,null,null,8457,"愛媛たいき農協"]
[null,null,null,null,8463,"西宇和農協"]
[null,null,null,null,8477,"東宇和農協"]
[null,null,null,null,8482,"えひめ南農協"]
[null,null,null,null,8500,"えひめ中央農協"]
[null,null,null,null,8551,"高知市農協"]
[null,null,null,null,8582,"高知県農協"]
[null,null,null,null,8589,"土佐くろしお農協"]
[null,null,null,null,8621,"宗像農協"]
[null,null,null,null,8626,"粕屋農協"]
[null,null,null,null,8632,"福岡市東部農協"]
[null,null,null,null,8633,"福岡市農協"]
[null,null,null,null,8635,"糸島農協"]
[null,null,null,null,8636,"筑紫農協"]
[null,null,null,null,8645,"筑前あさくら農協"]
[null,null,null,null,8653,"にじ農協"]
[null,null,null,null,8656,"みい農協"]
[null,null,null,null,8660,"久留米市農協"]
[null,null,null,null,8664,"三潴町農協"]
[null,null,null,null,8667,"福岡大城農協"]
[null,null,null,null,8668,"福岡八女農協"]
[null,null,null,null,8680,"柳川農協"]
[null,null,null,null,8689,"南筑後農協"]
[null,null,null,null,8692,"北九州農協"]
[null,null,null,null,8694,"直鞍農協"]
[null,null,null,null,8701,"福岡嘉穂農協"]
[null,null,null,null,8715,"田川農協"]
[null,null,null,null,8730,"福岡京築農協"]
[null,null,null,null,8740,"佐賀市中央農協"]
[null,null,null,null,8762,"佐賀県農協"]
[null,null,null,null,8766,"唐津農協"]
[null,null,null,null,8771,"伊万里市農協"]
[null,null,null,null,8794,"長崎西彼農協"]
[null,null,null,null,8813,"長崎県央農協"]
[null,null,null,null,8829,"島原雲仙農協"]
[null,null,null,null,8857,"ながさき西海農協"]
[null,null,null,null,8893,"ごとう農協"]
[null,null,null,null,8905,"壱岐市農協"]
[null,null,null,null,8906,"対馬農協"]
[null,null,null,null,8916,"熊本市農協"]
[null,null,null,null,8926,"玉名農協"]
[null,null,null,null,8941,"鹿本農協"]
[null,null,null,null,8949,"菊池地域農協"]
[null,null,null,null,8964,"阿蘇農協"]
[null,null,null,null,8982,"上益城農協"]
[null,null,null,null,9010,"熊本宇城農協"]
[null,null,null,null,9017,"八代地域農協"]
[null,null,null,null,9043,"あしきた農協"]
[null,null,null,null,9048,"球磨地域農協"]
[null,null,null,null,9069,"本渡五和農協"]
[null,null,null,null,9070,"あまくさ農協"]
[null,null,null,null,9072,"苓北町農協"]
[null,null,null,null,9103,"べっぷ日出農協"]
[null,null,null,null,9104,"大分県農協"]
[null,null,null,null,9145,"大分大山町農協"]
[null,null,null,null,9169,"宮崎中央農協"]
[null,null,null,null,9177,"綾町農協"]
[null,null,null,null,9178,"はまゆう農協"]
[null,null,null,null,9181,"串間市大束農協"]
[null,null,null,null,9184,"都城農協"]
[null,null,null,null,9193,"こばやし農協"]
[null,null,null,null,9197,"えびの市農協"]
[null,null,null,null,9200,"児湯農協"]
[null,null,null,null,9203,"尾鈴農協"]
[null,null,null,null,9205,"西都農協"]
[null,null,null,null,9208,"延岡農協"]
[null,null,null,null,9213,"日向農協"]
[null,null,null,null,9221,"高千穂地区農協"]
[null,null,null,null,9229,"鹿児島みらい農協"]
[null,null,null,null,9251,"いぶすき農協"]
[null,null,null,null,9257,"南さつま農協"]
[null,null,null,null,9270,"さつま日置農協"]
[null,null,null,null,9296,"北さつま農協"]
[null,null,null,null,9302,"鹿児島いずみ農協"]
[null,null,null,null,9319,"あいら農協"]
[null,null,null,null,9332,"そお鹿児島農協"]
[null,null,null,null,9338,"あおぞら農協"]
[null,null,null,null,9341,"鹿児島きもつき農協"]
[null,null,null,null,9347,"肝付吾平町農協"]
[null,null,null,null,9353,"種子屋久農協"]
[null,null,null,null,9363,"あまみ農協"]
[null,null,null,null,9375,"沖縄県農協"]
[null,null,null,null,9450,"北海道信漁連"]
[null,null,null,null,9453,"宮城県漁協"]
[null,null,null,null,9456,"福島県信漁連"]
[null,null,null,null,9461,"東日本信漁連"]
[null,null,null,null,9475,"京都府信漁連"]
[null,null,null,null,9477,"なぎさ信漁連"]
[null,null,null,null,9481,"ＪＦしまね漁協"]
[null,null,null,null,9483,"広島県信漁連"]
[null,null,null,null,9484,"山口県漁協"]
[null,null,null,null,9485,"徳島県信漁連"]
[null,null,null,null,9486,"西日本信漁連"]
[null,null,null,null,9487,"愛媛県信漁連"]
[null,null,null,null,9489,"九州信漁連"]
[null,null,null,null,9493,"大分県漁協"]
[null,null,null,null,9900,"ゆうちょ"]

{"sheet":"第1様式_A","index":4,"n_rows":40,"n_cols":37,"rows_kept":40,"cut":false,"hidden":true,"merged":[[19,18,19,22],[19,23,19,33],[1,0,1,29],[3,27,3,32],[5,26,5,27],[17,18,17,22],[17,23,17,33],[37,0,37,33],[39,0,39,33],[25,0,25,33],[27,0,27,33],[29,0,29,33],[34,18,34,22],[35,0,35,19],[35,20,35,22],[35,23,35,33]]}
[null,null,null,null,null,null,null,null,null,null,null,null,null,null,null,null,null,null,null,null,null,null,null,null,null,null,null,null,null,null,null,null,null,null,null,"行１のみ高さ13.5"]
["様式第１Ａ（日本産業規格Ａ列４番）",null,null,null,null,null,null,null,null,null,null,null,null,null,null,null,null,null,null,null,null,null,null,null,null,null,null,null,null,null,null,null,null,null,null,"文字または改行は12.75"]
[]
[null,null,null,null,null,null,null,null,null,null,null,null,null,null,null,null,null,null,null,null,null,null,null,null,null,null,"第",{"$f":"貸切バス!F3","v":0},null,null,null,null,null,"号",null,"間隔は7","列だけ調整して"]
[]
[null,null,null,null,null,null,null,null,null,null,null,null,null,null,null,null,null,null,null,null,null,null,null,null,null,null,"令和",null,6,"年",6,"月",10,"日"]
[]
[]
[]
[]
["    "]
["パシフィックコンサルタンツ株式会社"]
[]
["首都圏本社　本社長　殿"]
[]
[]
[]
[null,null,null,null,null,null,null,null,null,null,null,null,null,null,null,null,null,null," 住　　　　所",null,null,null,null,{"$f":"IF(貸切バス!M4=\"\",\"\",貸切バス!M4)","v":""}]
[]
[null,null,null,null,null,null,null,null,null,null,null,null,null,null,null,null,null,null," 氏名又は名称",null,null,null,null,{"$f":"IF(貸切バス!F4=\"\",\"\",貸切バス!F4)","v":""}]
[]
[]
[]
[]
[]
["令和５年度　「交通DX・GXによる経営改善支援事業等」"]
[]
["交付申請書"]
[]
[]
[]
[]
[]
[]
[]
["　 令和５年度「交通DX・GXによる経営改善支援事業等」金",null,null,null,null,null,null,null,null,null,null,null,null,null,null,null,null,null,null,null,{"$f":"集計用!AG7","v":0},null,null,"千円を交付されるよう、"]
[]
[" 補助金等に係る予算の執行の適正化に関する法律（昭和３０年法律第 １７９号）第５条及び"]
[]
[" 交付規程第７条の規定により、別紙様式第１のとおり申請します。　　　　"]

{"sheet":"第1様式_B","index":5,"n_rows":40,"n_cols":37,"rows_kept":40,"cut":false,"hidden":true,"merged":[[19,18,19,22],[19,23,19,33],[1,0,1,29],[3,27,3,32],[5,26,5,27],[17,18,17,22],[17,23,17,33],[39,0,39,33],[25,0,25,33],[27,0,27,33],[29,0,29,33],[34,18,34,22],[35,21,35,23],[37,0,37,33]]}
[null,null,null,null,null,null,null,null,null,null,null,null,null,null,null,null,null,null,null,null,null,null,null,null,null,null,null,null,null,null,null,null,null,null,null,"行１のみ高さ13.5"]
["様式第１Ｂ（日本産業規格Ａ列４番）",null,null,null,null,null,null,null,null,null,null,null,null,null,null,null,null,null,null,null,null,null,null,null,null,null,null,null,null,null,null,null,null,null,null,"文字または改行は12.75"]
[]
[null,null,null,null,null,null,null,null,null,null,null,null,null,null,null,null,null,null,null,null,null,null,null,null,null,null,"第",{"$f":"貸切バス!F3","v":0},null,null,null,null,null,"号",null,"間隔は7","列だけ調整して"]
[]
[null,null,null,null,null,null,null,null,null,null,null,null,null,null,null,null,null,null,null,null,null,null,null,null,null,null,"令和",null,6,"年",6,"月",10,"日"]
[]
[]
[]
[]
["    "]
["パシフィックコンサルタンツ株式会社"]
[]
["首都圏本社　本社長　殿"]
[]
[]
[]
[null,null,null,null,null,null,null,null,null,null,null,null,null,null,null,null,null,null," 住　　　　所",null,null,null,null,{"$f":"IF(貸切バス!M4=\"\",\"\",貸切バス!M4)","v":""}]
[]
[null,null,null,null,null,null,null,null,null,null,null,null,null,null,null,null,null,null," 氏名又は名称",null,null,null,null,{"$f":"IF(貸切バス!F4=\"\",\"\",貸切バス!F4)","v":""}]
[]
[]
[]
[]
[]
["令和５年度　「交通サービスインバウンド対応支援事業」"]
[]
["交付申請書"]
[]
[]
[]
[]
[]
[]
[]
["　令和５年度「交通サービスインバウンド対応支援事業」金",null,null,null,null,null,null,null,null,null,null,null,null,null,null,null,null,null,null,null,null,{"$f":"集計用!AH7","v":0},null,null,"千円を交付されるよう、"]
[]
["補助金等に係る予算の執行の適正化に関する法律（昭和 30 年法律第 179号）第５条及び交付規程"]
[]
["第７条の規定により、別紙様式第１のとおり申請します。　　　　"]